{"text_format":"1","workbook":"xlsx","n_sheets":8,"sheets":["Home","Planning","Acties","Medewerkers","Lijsten","Overzicht projecten","Overzicht per project","Rapportage medewerker"],"not_rendered":{"charts":0,"images":1,"macros":1,"external_links":0,"defined_names":5,"comments":0,"pivot_tables":0},"unopened":[],"bounds":{"document_bytes":16777216,"sheet_cells":100000,"rows_first":2000,"rows_last":500,"rows_between":2000,"halvings":0,"cell_chars":16384,"cell_head_chars":4096},"cells_cut":0,"cells_raw":0,"read":"whole","date_system":"1900"}

{"sheet":"Home","index":0,"n_rows":10,"n_cols":18,"rows_kept":10,"cut":false,"hidden":false,"merged":[]}
[null,"Datum start","2018-11-14"]
[null,"Datum nu",{"$f":"TODAY()","v":"2020-02-17"},null,"Projectplanning"]
[null,"Verschil",{"$f":"C2-C1","v":"1901-04-04"}]
[null,"Check 1"]
[null,"Check 2"]
[null,"Check 3"]
[null,"Check 4"]
[null,"Check 5",null,null,null,null,null,null,null,null,null,null,null,null,null,null,"*","info@terzake-excel.nl"]
[null,"Check 6",null,null,null,null,null,null,null,null,null,null,null,null,null,null,"(","0317 200 009"]
[null,"Check 7"]

{"sheet":"Planning","index":1,"n_rows":1,"n_cols":18,"rows_kept":1,"cut":false,"hidden":false,"merged":[]}
["Projecttitel","Startdatum","Einddatum","Status","Verantwoordelijke","Projectlid 1","Projectlid 2","Projectlid 3","Projectlid 4","Projectlid 5","Projectlid 6","Projectlid 7","Projectlid 8","Projectlid 9","Projectlid 10","Uren project","Kosten","Opmerkingen"]

{"sheet":"Acties","index":2,"n_rows":1,"n_cols":21,"rows_kept":1,"cut":false,"hidden":false,"merged":[]}
["Project","Actie","Startdatum","Einddatum","Status","Verantwoordelijke","Uitvoerende 1","Uitvoerende 2","Uitvoerende 3","Uitvoerende 4","Uitvoerende 5","Uitvoerende 6","Uitvoerende 7","Uitvoerende 8","Uitvoerende 9","Uitvoerende 10","Uren actie","Kosten","Opmerkingen","Hulpkolom","Hulpkolom"]

{"sheet":"Medewerkers","index":3,"n_rows":251,"n_cols":4,"rows_kept":251,"cut":false,"hidden":false,"merged":[]}
["Complete naam","Voornaam","Tussenvoegsel","Achternaam"]
[{"$f":"IF(C2=\"\",CONCATENATE(B2,\" \",D2),CONCATENATE(B2,\" \",C2,\" \",D2))","v":" "}]
[{"$f":"IF(C3=\"\",CONCATENATE(B3,\" \",D3),CONCATENATE(B3,\" \",C3,\" \",D3))","v":" "}]
[" "]
[" "]
[" "]
[" "]
[" "]
[" "]
[" "]
[" "]
[" "]
[" "]
[" "]
[" "]
[" "]
[" "]
[" "]
[" "]
[" "]
[" "]
[" "]
[" "]
[" "]
[" "]
[" "]
[" "]
[" "]
[" "]
[" "]
[" "]
[" "]
[" "]
[" "]
[" "]
[" "]
[" "]
[" "]
[" "]
[" "]
[" "]
[" "]
[" "]
[" "]
[" "]
[" "]
[" "]
[" "]
[" "]
[" "]
[" "]
[" "]
[" "]
[" "]
[" "]
[" "]
[" "]
[" "]
[" "]
[" "]
[" "]
[" "]
[" "]
[" "]
[" "]
[" "]
[{"$f":"IF(C67=\"\",CONCATENATE(B67,\" \",D67),CONCATENATE(B67,\" \",C67,\" \",D67))","v":" "}]
[" "]
[" "]
[" "]
[" "]
[" "]
[" "]
[" "]
[" "]
[" "]
[" "]
[" "]
[" "]
[" "]
[" "]
[" "]
[" "]
[" "]
[" "]
[" "]
[" "]
[" "]
[" "]
[" "]
[" "]
[" "]
[" "]
[" "]
[" "]
[" "]
[" "]
[" "]
[" "]
[" "]
[" "]
[" "]
[" "]
[" "]
[" "]
[" "]
[" "]
[" "]
[" "]
[" "]
[" "]
[" "]
[" "]
[" "]
[" "]
[" "]
[" "]
[" "]
[" "]
[" "]
[" "]
[" "]
[" "]
[" "]
[" "]
[" "]
[" "]
[" "]
[" "]
[" "]
[{"$f":"IF(C131=\"\",CONCATENATE(B131,\" \",D131),CONCATENATE(B131,\" \",C131,\" \",D131))","v":" "}]
[" "]
[" "]
[" "]
[" "]
[" "]
[" "]
[" "]
[" "]
[" "]
[" "]
[" "]
[" "]
[" "]
[" "]
[" "]
[" "]
[" "]
[" "]
[" "]
[" "]
[" "]
[" "]
[" "]
[" "]
[" "]
[" "]
[" "]
[" "]
[" "]
[" "]
[" "]
[" "]
[" "]
[" "]
[" "]
[" "]
[" "]
[" "]
[" "]
[" "]
[" "]
[" "]
[" "]
[" "]
[" "]
[" "]
[" "]
[" "]
[" "]
[" "]
[" "]
[" "]
[" "]
[" "]
[" "]
[" "]
[" "]
[" "]
[" "]
[" "]
[" "]
[" "]
[" "]
[{"$f":"IF(C195=\"\",CONCATENATE(B195,\" \",D195),CONCATENATE(B195,\" \",C195,\" \",D195))","v":" "}]
[" "]
[" "]
[" "]
[" "]
[" "]
[" "]
[" "]
[" "]
[" "]
[" "]
[" "]
[" "]
[" "]
[" "]
[" "]
[" "]
[" "]
[" "]
[" "]
[" "]
[" "]
[" "]
[" "]
[" "]
[" "]
[" "]
[" "]
[" "]
[" "]
[" "]
[" "]
[" "]
[" "]
[" "]
[" "]
[" "]
[" "]
[" "]
[" "]
[" "]
[" "]
[" "]
[" "]
[" "]
[" "]
[" "]
[" "]
[" "]
[" "]
[" "]
[" "]
[" "]
[" "]
[" "]
[" "]
[" "]

{"sheet":"Lijsten","index":4,"n_rows":3653,"n_cols":6,"rows_kept":3653,"cut":false,"hidden":false,"merged":[]}
["Status project / actie",null,"2016-01-01",1,201601,2016]
["In voorbereiding",null,"2016-01-02",1,201601,2017]
["Lopend",null,"2016-01-03",1,201601,2018]
["Afgerond",null,"2016-01-04",1,201601,2019]
[null,null,"2016-01-05",1,201601,2020]
[null,null,"2016-01-06",1,201601,2021]
[null,null,"2016-01-07",1,201601,2022]
[null,null,"2016-01-08",1,201601,2023]
[null,null,"2016-01-09",1,201601,2024]
[null,null,"2016-01-10",1,201601,2025]
[null,null,"2016-01-11",2,201602]
[null,null,"2016-01-12",2,201602]
[null,null,"2016-01-13",2,201602]
[null,null,"2016-01-14",2,201602]
[null,null,"2016-01-15",2,201602]
[null,null,"2016-01-16",2,201602]
[null,null,"2016-01-17",2,201602]
[null,null,"2016-01-18",3,201603]
[null,null,"2016-01-19",3,201603]
[null,null,"2016-01-20",3,201603]
[null,null,"2016-01-21",3,201603]
[null,null,"2016-01-22",3,201603]
[null,null,"2016-01-23",3,201603]
[null,null,"2016-01-24",3,201603]
[null,null,"2016-01-25",4,201604]
[null,null,"2016-01-26",4,201604]
[null,null,"2016-01-27",4,201604]
[null,null,"2016-01-28",4,201604]
[null,null,"2016-01-29",4,201604]
[null,null,"2016-01-30",4,201604]
[null,null,"2016-01-31",4,201604]
[null,null,"2016-02-01",5,201605]
[null,null,"2016-02-02",5,201605]
[null,null,"2016-02-03",5,201605]
[null,null,"2016-02-04",5,201605]
[null,null,"2016-02-05",5,201605]
[null,null,"2016-02-06",5,201605]
[null,null,"2016-02-07",5,201605]
[null,null,"2016-02-08",6,201606]
[null,null,"2016-02-09",6,201606]
[null,null,"2016-02-10",6,201606]
[null,null,"2016-02-11",6,201606]
[null,null,"2016-02-12",6,201606]
[null,null,"2016-02-13",6,201606]
[null,null,"2016-02-14",6,201606]
[null,null,"2016-02-15",7,201607]
[null,null,"2016-02-16",7,201607]
[null,null,"2016-02-17",7,201607]
[null,null,"2016-02-18",7,201607]
[null,null,"2016-02-19",7,201607]
[null,null,"2016-02-20",7,201607]
[null,null,"2016-02-21",7,201607]
[null,null,"2016-02-22",8,201608]
[null,null,"2016-02-23",8,201608]
[null,null,"2016-02-24",8,201608]
[null,null,"2016-02-25",8,201608]
[null,null,"2016-02-26",8,201608]
[null,null,"2016-02-27",8,201608]
[null,null,"2016-02-28",8,201608]
[null,null,"2016-02-29",9,201609]
[null,null,"2016-03-01",9,201609]
[null,null,"2016-03-02",9,201609]
[null,null,"2016-03-03",9,201609]
[null,null,"2016-03-04",9,201609]
[null,null,"2016-03-05",9,201609]
[null,null,"2016-03-06",9,201609]
[null,null,"2016-03-07",10,201610]
[null,null,"2016-03-08",10,201610]
[null,null,"2016-03-09",10,201610]
[null,null,"2016-03-10",10,201610]
[null,null,"2016-03-11",10,201610]
[null,null,"2016-03-12",10,201610]
[null,null,"2016-03-13",10,201610]
[null,null,"2016-03-14",11,201611]
[null,null,"2016-03-15",11,201611]
[null,null,"2016-03-16",11,201611]
[null,null,"2016-03-17",11,201611]
[null,null,"2016-03-18",11,201611]
[null,null,"2016-03-19",11,201611]
[null,null,"2016-03-20",11,201611]
[null,null,"2016-03-21",12,201612]
[null,null,"2016-03-22",12,201612]
[null,null,"2016-03-23",12,201612]
[null,null,"2016-03-24",12,201612]
[null,null,"2016-03-25",12,201612]
[null,null,"2016-03-26",12,201612]
[null,null,"2016-03-27",12,201612]
[null,null,"2016-03-28",13,201613]
[null,null,"2016-03-29",13,201613]
[null,null,"2016-03-30",13,201613]
[null,null,"2016-03-31",13,201613]
[null,null,"2016-04-01",13,201613]
[null,null,"2016-04-02",13,201613]
[null,null,"2016-04-03",13,201613]
[null,null,"2016-04-04",14,201614]
[null,null,"2016-04-05",14,201614]
[null,null,"2016-04-06",14,201614]
[null,null,"2016-04-07",14,201614]
[null,null,"2016-04-08",14,201614]
[null,null,"2016-04-09",14,201614]
[null,null,"2016-04-10",14,201614]
[null,null,"2016-04-11",15,201615]
[null,null,"2016-04-12",15,201615]
[null,null,"2016-04-13",15,201615]
[null,null,"2016-04-14",15,201615]
[null,null,"2016-04-15",15,201615]
[null,null,"2016-04-16",15,201615]
[null,null,"2016-04-17",15,201615]
[null,null,"2016-04-18",16,201616]
[null,null,"2016-04-19",16,201616]
[null,null,"2016-04-20",16,201616]
[null,null,"2016-04-21",16,201616]
[null,null,"2016-04-22",16,201616]
[null,null,"2016-04-23",16,201616]
[null,null,"2016-04-24",16,201616]
[null,null,"2016-04-25",17,201617]
[null,null,"2016-04-26",17,201617]
[null,null,"2016-04-27",17,201617]
[null,null,"2016-04-28",17,201617]
[null,null,"2016-04-29",17,201617]
[null,null,"2016-04-30",17,201617]
[null,null,"2016-05-01",17,201617]
[null,null,"2016-05-02",18,201618]
[null,null,"2016-05-03",18,201618]
[null,null,"2016-05-04",18,201618]
[null,null,"2016-05-05",18,201618]
[null,null,"2016-05-06",18,201618]
[null,null,"2016-05-07",18,201618]
[null,null,"2016-05-08",18,201618]
[null,null,"2016-05-09",19,201619]
[null,null,"2016-05-10",19,201619]
[null,null,"2016-05-11",19,201619]
[null,null,"2016-05-12",19,201619]
[null,null,"2016-05-13",19,201619]
[null,null,"2016-05-14",19,201619]
[null,null,"2016-05-15",19,201619]
[null,null,"2016-05-16",20,201620]
[null,null,"2016-05-17",20,201620]
[null,null,"2016-05-18",20,201620]
[null,null,"2016-05-19",20,201620]
[null,null,"2016-05-20",20,201620]
[null,null,"2016-05-21",20,201620]
[null,null,"2016-05-22",20,201620]
[null,null,"2016-05-23",21,201621]
[null,null,"2016-05-24",21,201621]
[null,null,"2016-05-25",21,201621]
[null,null,"2016-05-26",21,201621]
[null,null,"2016-05-27",21,201621]
[null,null,"2016-05-28",21,201621]
[null,null,"2016-05-29",21,201621]
[null,null,"2016-05-30",22,201622]
[null,null,"2016-05-31",22,201622]
[null,null,"2016-06-01",22,201622]
[null,null,"2016-06-02",22,201622]
[null,null,"2016-06-03",22,201622]
[null,null,"2016-06-04",22,201622]
[null,null,"2016-06-05",22,201622]
[null,null,"2016-06-06",23,201623]
[null,null,"2016-06-07",23,201623]
[null,null,"2016-06-08",23,201623]
[null,null,"2016-06-09",23,201623]
[null,null,"2016-06-10",23,201623]
[null,null,"2016-06-11",23,201623]
[null,null,"2016-06-12",23,201623]
[null,null,"2016-06-13",24,201624]
[null,null,"2016-06-14",24,201624]
[null,null,"2016-06-15",24,201624]
[null,null,"2016-06-16",24,201624]
[null,null,"2016-06-17",24,201624]
[null,null,"2016-06-18",24,201624]
[null,null,"2016-06-19",24,201624]
[null,null,"2016-06-20",25,201625]
[null,null,"2016-06-21",25,201625]
[null,null,"2016-06-22",25,201625]
[null,null,"2016-06-23",25,201625]
[null,null,"2016-06-24",25,201625]
[null,null,"2016-06-25",25,201625]
[null,null,"2016-06-26",25,201625]
[null,null,"2016-06-27",26,201626]
[null,null,"2016-06-28",26,201626]
[null,null,"2016-06-29",26,201626]
[null,null,"2016-06-30",26,201626]
[null,null,"2016-07-01",26,201626]
[null,null,"2016-07-02",26,201626]
[null,null,"2016-07-03",26,201626]
[null,null,"2016-07-04",27,201627]
[null,null,"2016-07-05",27,201627]
[null,null,"2016-07-06",27,201627]
[null,null,"2016-07-07",27,201627]
[null,null,"2016-07-08",27,201627]
[null,null,"2016-07-09",27,201627]
[null,null,"2016-07-10",27,201627]
[null,null,"2016-07-11",28,201628]
[null,null,"2016-07-12",28,201628]
[null,null,"2016-07-13",28,201628]
[null,null,"2016-07-14",28,201628]
[null,null,"2016-07-15",28,201628]
[null,null,"2016-07-16",28,201628]
[null,null,"2016-07-17",28,201628]
[null,null,"2016-07-18",29,201629]
[null,null,"2016-07-19",29,201629]
[null,null,"2016-07-20",29,201629]
[null,null,"2016-07-21",29,201629]
[null,null,"2016-07-22",29,201629]
[null,null,"2016-07-23",29,201629]
[null,null,"2016-07-24",29,201629]
[null,null,"2016-07-25",30,201630]
[null,null,"2016-07-26",30,201630]
[null,null,"2016-07-27",30,201630]
[null,null,"2016-07-28",30,201630]
[null,null,"2016-07-29",30,201630]
[null,null,"2016-07-30",30,201630]
[null,null,"2016-07-31",30,201630]
[null,null,"2016-08-01",31,201631]
[null,null,"2016-08-02",31,201631]
[null,null,"2016-08-03",31,201631]
[null,null,"2016-08-04",31,201631]
[null,null,"2016-08-05",31,201631]
[null,null,"2016-08-06",31,201631]
[null,null,"2016-08-07",31,201631]
[null,null,"2016-08-08",32,201632]
[null,null,"2016-08-09",32,201632]
[null,null,"2016-08-10",32,201632]
[null,null,"2016-08-11",32,201632]
[null,null,"2016-08-12",32,201632]
[null,null,"2016-08-13",32,201632]
[null,null,"2016-08-14",32,201632]
[null,null,"2016-08-15",33,201633]
[null,null,"2016-08-16",33,201633]
[null,null,"2016-08-17",33,201633]
[null,null,"2016-08-18",33,201633]
[null,null,"2016-08-19",33,201633]
[null,null,"2016-08-20",33,201633]
[null,null,"2016-08-21",33,201633]
[null,null,"2016-08-22",34,201634]
[null,null,"2016-08-23",34,201634]
[null,null,"2016-08-24",34,201634]
[null,null,"2016-08-25",34,201634]
[null,null,"2016-08-26",34,201634]
[null,null,"2016-08-27",34,201634]
[null,null,"2016-08-28",34,201634]
[null,null,"2016-08-29",35,201635]
[null,null,"2016-08-30",35,201635]
[null,null,"2016-08-31",35,201635]
[null,null,"2016-09-01",35,201635]
[null,null,"2016-09-02",35,201635]
[null,null,"2016-09-03",35,201635]
[null,null,"2016-09-04",35,201635]
[null,null,"2016-09-05",36,201636]
[null,null,"2016-09-06",36,201636]
[null,null,"2016-09-07",36,201636]
[null,null,"2016-09-08",36,201636]
[null,null,"2016-09-09",36,201636]
[null,null,"2016-09-10",36,201636]
[null,null,"2016-09-11",36,201636]
[null,null,"2016-09-12",37,201637]
[null,null,"2016-09-13",37,201637]
[null,null,"2016-09-14",37,201637]
[null,null,"2016-09-15",37,201637]
[null,null,"2016-09-16",37,201637]
[null,null,"2016-09-17",37,201637]
[null,null,"2016-09-18",37,201637]
[null,null,"2016-09-19",38,201638]
[null,null,"2016-09-20",38,201638]
[null,null,"2016-09-21",38,201638]
[null,null,"2016-09-22",38,201638]
[null,null,"2016-09-23",38,201638]
[null,null,"2016-09-24",38,201638]
[null,null,"2016-09-25",38,201638]
[null,null,"2016-09-26",39,201639]
[null,null,"2016-09-27",39,201639]
[null,null,"2016-09-28",39,201639]
[null,null,"2016-09-29",39,201639]
[null,null,"2016-09-30",39,201639]
[null,null,"2016-10-01",39,201639]
[null,null,"2016-10-02",39,201639]
[null,null,"2016-10-03",40,201640]
[null,null,"2016-10-04",40,201640]
[null,null,"2016-10-05",40,201640]
[null,null,"2016-10-06",40,201640]
[null,null,"2016-10-07",40,201640]
[null,null,"2016-10-08",40,201640]
[null,null,"2016-10-09",40,201640]
[null,null,"2016-10-10",41,201641]
[null,null,"2016-10-11",41,201641]
[null,null,"2016-10-12",41,201641]
[null,null,"2016-10-13",41,201641]
[null,null,"2016-10-14",41,201641]
[null,null,"2016-10-15",41,201641]
[null,null,"2016-10-16",41,201641]
[null,null,"2016-10-17",42,201642]
[null,null,"2016-10-18",42,201642]
[null,null,"2016-10-19",42,201642]
[null,null,"2016-10-20",42,201642]
[null,null,"2016-10-21",42,201642]
[null,null,"2016-10-22",42,201642]
[null,null,"2016-10-23",42,201642]
[null,null,"2016-10-24",43,201643]
[null,null,"2016-10-25",43,201643]
[null,null,"2016-10-26",43,201643]
[null,null,"2016-10-27",43,201643]
[null,null,"2016-10-28",43,201643]
[null,null,"2016-10-29",43,201643]
[null,null,"2016-10-30",43,201643]
[null,null,"2016-10-31",44,201644]
[null,null,"2016-11-01",44,201644]
[null,null,"2016-11-02",44,201644]
[null,null,"2016-11-03",44,201644]
[null,null,"2016-11-04",44,201644]
[null,null,"2016-11-05",44,201644]
[null,null,"2016-11-06",44,201644]
[null,null,"2016-11-07",45,201645]
[null,null,"2016-11-08",45,201645]
[null,null,"2016-11-09",45,201645]
[null,null,"2016-11-10",45,201645]
[null,null,"2016-11-11",45,201645]
[null,null,"2016-11-12",45,201645]
[null,null,"2016-11-13",45,201645]
[null,null,"2016-11-14",46,201646]
[null,null,"2016-11-15",46,201646]
[null,null,"2016-11-16",46,201646]
[null,null,"2016-11-17",46,201646]
[null,null,"2016-11-18",46,201646]
[null,null,"2016-11-19",46,201646]
[null,null,"2016-11-20",46,201646]
[null,null,"2016-11-21",47,201647]
[null,null,"2016-11-22",47,201647]
[null,null,"2016-11-23",47,201647]
[null,null,"2016-11-24",47,201647]
[null,null,"2016-11-25",47,201647]
[null,null,"2016-11-26",47,201647]
[null,null,"2016-11-27",47,201647]
[null,null,"2016-11-28",48,201648]
[null,null,"2016-11-29",48,201648]
[null,null,"2016-11-30",48,201648]
[null,null,"2016-12-01",48,201648]
[null,null,"2016-12-02",48,201648]
[null,null,"2016-12-03",48,201648]
[null,null,"2016-12-04",48,201648]
[null,null,"2016-12-05",49,201649]
[null,null,"2016-12-06",49,201649]
[null,null,"2016-12-07",49,201649]
[null,null,"2016-12-08",49,201649]
[null,null,"2016-12-09",49,201649]
[null,null,"2016-12-10",49,201649]
[null,null,"2016-12-11",49,201649]
[null,null,"2016-12-12",50,201650]
[null,null,"2016-12-13",50,201650]
[null,null,"2016-12-14",50,201650]
[null,null,"2016-12-15",50,201650]
[null,null,"2016-12-16",50,201650]
[null,null,"2016-12-17",50,201650]
[null,null,"2016-12-18",50,201650]
[null,null,"2016-12-19",51,201651]
[null,null,"2016-12-20",51,201651]
[null,null,"2016-12-21",51,201651]
[null,null,"2016-12-22",51,201651]
[null,null,"2016-12-23",51,201651]
[null,null,"2016-12-24",51,201651]
[null,null,"2016-12-25",51,201651]
[null,null,"2016-12-26",52,201652]
[null,null,"2016-12-27",52,201652]
[null,null,"2016-12-28",52,201652]
[null,null,"2016-12-29",52,201652]
[null,null,"2016-12-30",52,201652]
[null,null,"2016-12-31",52,201652]
[null,null,"2017-01-01",1,201701]
[null,null,"2017-01-02",1,201701]
[null,null,"2017-01-03",1,201701]
[null,null,"2017-01-04",1,201701]
[null,null,"2017-01-05",1,201701]
[null,null,"2017-01-06",1,201701]
[null,null,"2017-01-07",1,201701]
[null,null,"2017-01-08",1,201701]
[null,null,"2017-01-09",2,201702]
[null,null,"2017-01-10",2,201702]
[null,null,"2017-01-11",2,201702]
[null,null,"2017-01-12",2,201702]
[null,null,"2017-01-13",2,201702]
[null,null,"2017-01-14",2,201702]
[null,null,"2017-01-15",2,201702]
[null,null,"2017-01-16",3,201703]
[null,null,"2017-01-17",3,201703]
[null,null,"2017-01-18",3,201703]
[null,null,"2017-01-19",3,201703]
[null,null,"2017-01-20",3,201703]
[null,null,"2017-01-21",3,201703]
[null,null,"2017-01-22",3,201703]
[null,null,"2017-01-23",4,201704]
[null,null,"2017-01-24",4,201704]
[null,null,"2017-01-25",4,201704]
[null,null,"2017-01-26",4,201704]
[null,null,"2017-01-27",4,201704]
[null,null,"2017-01-28",4,201704]
[null,null,"2017-01-29",4,201704]
[null,null,"2017-01-30",5,201705]
[null,null,"2017-01-31",5,201705]
[null,null,"2017-02-01",5,201705]
[null,null,"2017-02-02",5,201705]
[null,null,"2017-02-03",5,201705]
[null,null,"2017-02-04",5,201705]
[null,null,"2017-02-05",5,201705]
[null,null,"2017-02-06",6,201706]
[null,null,"2017-02-07",6,201706]
[null,null,"2017-02-08",6,201706]
[null,null,"2017-02-09",6,201706]
[null,null,"2017-02-10",6,201706]
[null,null,"2017-02-11",6,201706]
[null,null,"2017-02-12",6,201706]
[null,null,"2017-02-13",7,201707]
[null,null,"2017-02-14",7,201707]
[null,null,"2017-02-15",7,201707]
[null,null,"2017-02-16",7,201707]
[null,null,"2017-02-17",7,201707]
[null,null,"2017-02-18",7,201707]
[null,null,"2017-02-19",7,201707]
[null,null,"2017-02-20",8,201708]
[null,null,"2017-02-21",8,201708]
[null,null,"2017-02-22",8,201708]
[null,null,"2017-02-23",8,201708]
[null,null,"2017-02-24",8,201708]
[null,null,"2017-02-25",8,201708]
[null,null,"2017-02-26",8,201708]
[null,null,"2017-02-27",9,201709]
[null,null,"2017-02-28",9,201709]
[null,null,"2017-03-01",9,201709]
[null,null,"2017-03-02",9,201709]
[null,null,"2017-03-03",9,201709]
[null,null,"2017-03-04",9,201709]
[null,null,"2017-03-05",9,201709]
[null,null,"2017-03-06",10,201710]
[null,null,"2017-03-07",10,201710]
[null,null,"2017-03-08",10,201710]
[null,null,"2017-03-09",10,201710]
[null,null,"2017-03-10",10,201710]
[null,null,"2017-03-11",10,201710]
[null,null,"2017-03-12",10,201710]
[null,null,"2017-03-13",11,201711]
[null,null,"2017-03-14",11,201711]
[null,null,"2017-03-15",11,201711]
[null,null,"2017-03-16",11,201711]
[null,null,"2017-03-17",11,201711]
[null,null,"2017-03-18",11,201711]
[null,null,"2017-03-19",11,201711]
[null,null,"2017-03-20",12,201712]
[null,null,"2017-03-21",12,201712]
[null,null,"2017-03-22",12,201712]
[null,null,"2017-03-23",12,201712]
[null,null,"2017-03-24",12,201712]
[null,null,"2017-03-25",12,201712]
[null,null,"2017-03-26",12,201712]
[null,null,"2017-03-27",13,201713]
[null,null,"2017-03-28",13,201713]
[null,null,"2017-03-29",13,201713]
[null,null,"2017-03-30",13,201713]
[null,null,"2017-03-31",13,201713]
[null,null,"2017-04-01",13,201713]
[null,null,"2017-04-02",13,201713]
[null,null,"2017-04-03",14,201714]
[null,null,"2017-04-04",14,201714]
[null,null,"2017-04-05",14,201714]
[null,null,"2017-04-06",14,201714]
[null,null,"2017-04-07",14,201714]
[null,null,"2017-04-08",14,201714]
[null,null,"2017-04-09",14,201714]
[null,null,"2017-04-10",15,201715]
[null,null,"2017-04-11",15,201715]
[null,null,"2017-04-12",15,201715]
[null,null,"2017-04-13",15,201715]
[null,null,"2017-04-14",15,201715]
[null,null,"2017-04-15",15,201715]
[null,null,"2017-04-16",15,201715]
[null,null,"2017-04-17",16,201716]
[null,null,"2017-04-18",16,201716]
[null,null,"2017-04-19",16,201716]
[null,null,"2017-04-20",16,201716]
[null,null,"2017-04-21",16,201716]
[null,null,"2017-04-22",16,201716]
[null,null,"2017-04-23",16,201716]
[null,null,"2017-04-24",17,201717]
[null,null,"2017-04-25",17,201717]
[null,null,"2017-04-26",17,201717]
[null,null,"2017-04-27",17,201717]
[null,null,"2017-04-28",17,201717]
[null,null,"2017-04-29",17,201717]
[null,null,"2017-04-30",17,201717]
[null,null,"2017-05-01",18,201718]
[null,null,"2017-05-02",18,201718]
[null,null,"2017-05-03",18,201718]
[null,null,"2017-05-04",18,201718]
[null,null,"2017-05-05",18,201718]
[null,null,"2017-05-06",18,201718]
[null,null,"2017-05-07",18,201718]
[null,null,"2017-05-08",19,201719]
[null,null,"2017-05-09",19,201719]
[null,null,"2017-05-10",19,201719]
[null,null,"2017-05-11",19,201719]
[null,null,"2017-05-12",19,201719]
[null,null,"2017-05-13",19,201719]
[null,null,"2017-05-14",19,201719]
[null,null,"2017-05-15",20,201720]
[null,null,"2017-05-16",20,201720]
[null,null,"2017-05-17",20,201720]
[null,null,"2017-05-18",20,201720]
[null,null,"2017-05-19",20,201720]
[null,null,"2017-05-20",20,201720]
[null,null,"2017-05-21",20,201720]
[null,null,"2017-05-22",21,201721]
[null,null,"2017-05-23",21,201721]
[null,null,"2017-05-24",21,201721]
[null,null,"2017-05-25",21,201721]
[null,null,"2017-05-26",21,201721]
[null,null,"2017-05-27",21,201721]
[null,null,"2017-05-28",21,201721]
[null,null,"2017-05-29",22,201722]
[null,null,"2017-05-30",22,201722]
[null,null,"2017-05-31",22,201722]
[null,null,"2017-06-01",22,201722]
[null,null,"2017-06-02",22,201722]
[null,null,"2017-06-03",22,201722]
[null,null,"2017-06-04",22,201722]
[null,null,"2017-06-05",23,201723]
[null,null,"2017-06-06",23,201723]
[null,null,"2017-06-07",23,201723]
[null,null,"2017-06-08",23,201723]
[null,null,"2017-06-09",23,201723]
[null,null,"2017-06-10",23,201723]
[null,null,"2017-06-11",23,201723]
[null,null,"2017-06-12",24,201724]
[null,null,"2017-06-13",24,201724]
[null,null,"2017-06-14",24,201724]
[null,null,"2017-06-15",24,201724]
[null,null,"2017-06-16",24,201724]
[null,null,"2017-06-17",24,201724]
[null,null,"2017-06-18",24,201724]
[null,null,"2017-06-19",25,201725]
[null,null,"2017-06-20",25,201725]
[null,null,"2017-06-21",25,201725]
[null,null,"2017-06-22",25,201725]
[null,null,"2017-06-23",25,201725]
[null,null,"2017-06-24",25,201725]
[null,null,"2017-06-25",25,201725]
[null,null,"2017-06-26",26,201726]
[null,null,"2017-06-27",26,201726]
[null,null,"2017-06-28",26,201726]
[null,null,"2017-06-29",26,201726]
[null,null,"2017-06-30",26,201726]
[null,null,"2017-07-01",26,201726]
[null,null,"2017-07-02",26,201726]
[null,null,"2017-07-03",27,201727]
[null,null,"2017-07-04",27,201727]
[null,null,"2017-07-05",27,201727]
[null,null,"2017-07-06",27,201727]
[null,null,"2017-07-07",27,201727]
[null,null,"2017-07-08",27,201727]
[null,null,"2017-07-09",27,201727]
[null,null,"2017-07-10",28,201728]
[null,null,"2017-07-11",28,201728]
[null,null,"2017-07-12",28,201728]
[null,null,"2017-07-13",28,201728]
[null,null,"2017-07-14",28,201728]
[null,null,"2017-07-15",28,201728]
[null,null,"2017-07-16",28,201728]
[null,null,"2017-07-17",29,201729]
[null,null,"2017-07-18",29,201729]
[null,null,"2017-07-19",29,201729]
[null,null,"2017-07-20",29,201729]
[null,null,"2017-07-21",29,201729]
[null,null,"2017-07-22",29,201729]
[null,null,"2017-07-23",29,201729]
[null,null,"2017-07-24",30,201730]
[null,null,"2017-07-25",30,201730]
[null,null,"2017-07-26",30,201730]
[null,null,"2017-07-27",30,201730]
[null,null,"2017-07-28",30,201730]
[null,null,"2017-07-29",30,201730]
[null,null,"2017-07-30",30,201730]
[null,null,"2017-07-31",31,201731]
[null,null,"2017-08-01",31,201731]
[null,null,"2017-08-02",31,201731]
[null,null,"2017-08-03",31,201731]
[null,null,"2017-08-04",31,201731]
[null,null,"2017-08-05",31,201731]
[null,null,"2017-08-06",31,201731]
[null,null,"2017-08-07",32,201732]
[null,null,"2017-08-08",32,201732]
[null,null,"2017-08-09",32,201732]
[null,null,"2017-08-10",32,201732]
[null,null,"2017-08-11",32,201732]
[null,null,"2017-08-12",32,201732]
[null,null,"2017-08-13",32,201732]
[null,null,"2017-08-14",33,201733]
[null,null,"2017-08-15",33,201733]
[null,null,"2017-08-16",33,201733]
[null,null,"2017-08-17",33,201733]
[null,null,"2017-08-18",33,201733]
[null,null,"2017-08-19",33,201733]
[null,null,"2017-08-20",33,201733]
[null,null,"2017-08-21",34,201734]
[null,null,"2017-08-22",34,201734]
[null,null,"2017-08-23",34,201734]
[null,null,"2017-08-24",34,201734]
[null,null,"2017-08-25",34,201734]
[null,null,"2017-08-26",34,201734]
[null,null,"2017-08-27",34,201734]
[null,null,"2017-08-28",35,201735]
[null,null,"2017-08-29",35,201735]
[null,null,"2017-08-30",35,201735]
[null,null,"2017-08-31",35,201735]
[null,null,"2017-09-01",35,201735]
[null,null,"2017-09-02",35,201735]
[null,null,"2017-09-03",35,201735]
[null,null,"2017-09-04",36,201736]
[null,null,"2017-09-05",36,201736]
[null,null,"2017-09-06",36,201736]
[null,null,"2017-09-07",36,201736]
[null,null,"2017-09-08",36,201736]
[null,null,"2017-09-09",36,201736]
[null,null,"2017-09-10",36,201736]
[null,null,"2017-09-11",37,201737]
[null,null,"2017-09-12",37,201737]
[null,null,"2017-09-13",37,201737]
[null,null,"2017-09-14",37,201737]
[null,null,"2017-09-15",37,201737]
[null,null,"2017-09-16",37,201737]
[null,null,"2017-09-17",37,201737]
[null,null,"2017-09-18",38,201738]
[null,null,"2017-09-19",38,201738]
[null,null,"2017-09-20",38,201738]
[null,null,"2017-09-21",38,201738]
[null,null,"2017-09-22",38,201738]
[null,null,"2017-09-23",38,201738]
[null,null,"2017-09-24",38,201738]
[null,null,"2017-09-25",39,201739]
[null,null,"2017-09-26",39,201739]
[null,null,"2017-09-27",39,201739]
[null,null,"2017-09-28",39,201739]
[null,null,"2017-09-29",39,201739]
[null,null,"2017-09-30",39,201739]
[null,null,"2017-10-01",39,201739]
[null,null,"2017-10-02",40,201740]
[null,null,"2017-10-03",40,201740]
[null,null,"2017-10-04",40,201740]
[null,null,"2017-10-05",40,201740]
[null,null,"2017-10-06",40,201740]
[null,null,"2017-10-07",40,201740]
[null,null,"2017-10-08",40,201740]
[null,null,"2017-10-09",41,201741]
[null,null,"2017-10-10",41,201741]
[null,null,"2017-10-11",41,201741]
[null,null,"2017-10-12",41,201741]
[null,null,"2017-10-13",41,201741]
[null,null,"2017-10-14",41,201741]
[null,null,"2017-10-15",41,201741]
[null,null,"2017-10-16",42,201742]
[null,null,"2017-10-17",42,201742]
[null,null,"2017-10-18",42,201742]
[null,null,"2017-10-19",42,201742]
[null,null,"2017-10-20",42,201742]
[null,null,"2017-10-21",42,201742]
[null,null,"2017-10-22",42,201742]
[null,null,"2017-10-23",43,201743]
[null,null,"2017-10-24",43,201743]
[null,null,"2017-10-25",43,201743]
[null,null,"2017-10-26",43,201743]
[null,null,"2017-10-27",43,201743]
[null,null,"2017-10-28",43,201743]
[null,null,"2017-10-29",43,201743]
[null,null,"2017-10-30",44,201744]
[null,null,"2017-10-31",44,201744]
[null,null,"2017-11-01",44,201744]
[null,null,"2017-11-02",44,201744]
[null,null,"2017-11-03",44,201744]
[null,null,"2017-11-04",44,201744]
[null,null,"2017-11-05",44,201744]
[null,null,"2017-11-06",45,201745]
[null,null,"2017-11-07",45,201745]
[null,null,"2017-11-08",45,201745]
[null,null,"2017-11-09",45,201745]
[null,null,"2017-11-10",45,201745]
[null,null,"2017-11-11",45,201745]
[null,null,"2017-11-12",45,201745]
[null,null,"2017-11-13",46,201746]
[null,null,"2017-11-14",46,201746]
[null,null,"2017-11-15",46,201746]
[null,null,"2017-11-16",46,201746]
[null,null,"2017-11-17",46,201746]
[null,null,"2017-11-18",46,201746]
[null,null,"2017-11-19",46,201746]
[null,null,"2017-11-20",47,201747]
[null,null,"2017-11-21",47,201747]
[null,null,"2017-11-22",47,201747]
[null,null,"2017-11-23",47,201747]
[null,null,"2017-11-24",47,201747]
[null,null,"2017-11-25",47,201747]
[null,null,"2017-11-26",47,201747]
[null,null,"2017-11-27",48,201748]
[null,null,"2017-11-28",48,201748]
[null,null,"2017-11-29",48,201748]
[null,null,"2017-11-30",48,201748]
[null,null,"2017-12-01",48,201748]
[null,null,"2017-12-02",48,201748]
[null,null,"2017-12-03",48,201748]
[null,null,"2017-12-04",49,201749]
[null,null,"2017-12-05",49,201749]
[null,null,"2017-12-06",49,201749]
[null,null,"2017-12-07",49,201749]
[null,null,"2017-12-08",49,201749]
[null,null,"2017-12-09",49,201749]
[null,null,"2017-12-10",49,201749]
[null,null,"2017-12-11",50,201750]
[null,null,"2017-12-12",50,201750]
[null,null,"2017-12-13",50,201750]
[null,null,"2017-12-14",50,201750]
[null,null,"2017-12-15",50,201750]
[null,null,"2017-12-16",50,201750]
[null,null,"2017-12-17",50,201750]
[null,null,"2017-12-18",51,201751]
[null,null,"2017-12-19",51,201751]
[null,null,"2017-12-20",51,201751]
[null,null,"2017-12-21",51,201751]
[null,null,"2017-12-22",51,201751]
[null,null,"2017-12-23",51,201751]
[null,null,"2017-12-24",51,201751]
[null,null,"2017-12-25",52,201752]
[null,null,"2017-12-26",52,201752]
[null,null,"2017-12-27",52,201752]
[null,null,"2017-12-28",52,201752]
[null,null,"2017-12-29",52,201752]
[null,null,"2017-12-30",52,201752]
[null,null,"2017-12-31",52,201752]
[null,null,"2018-01-01",1,201801]
[null,null,"2018-01-02",1,201801]
[null,null,"2018-01-03",1,201801]
[null,null,"2018-01-04",1,201801]
[null,null,"2018-01-05",1,201801]
[null,null,"2018-01-06",1,201801]
[null,null,"2018-01-07",1,201801]
[null,null,"2018-01-08",2,201802]
[null,null,"2018-01-09",2,201802]
[null,null,"2018-01-10",2,201802]
[null,null,"2018-01-11",2,201802]
[null,null,"2018-01-12",2,201802]
[null,null,"2018-01-13",2,201802]
[null,null,"2018-01-14",2,201802]
[null,null,"2018-01-15",3,201803]
[null,null,"2018-01-16",3,201803]
[null,null,"2018-01-17",3,201803]
[null,null,"2018-01-18",3,201803]
[null,null,"2018-01-19",3,201803]
[null,null,"2018-01-20",3,201803]
[null,null,"2018-01-21",3,201803]
[null,null,"2018-01-22",4,201804]
[null,null,"2018-01-23",4,201804]
[null,null,"2018-01-24",4,201804]
[null,null,"2018-01-25",4,201804]
[null,null,"2018-01-26",4,201804]
[null,null,"2018-01-27",4,201804]
[null,null,"2018-01-28",4,201804]
[null,null,"2018-01-29",5,201805]
[null,null,"2018-01-30",5,201805]
[null,null,"2018-01-31",5,201805]
[null,null,"2018-02-01",5,201805]
[null,null,"2018-02-02",5,201805]
[null,null,"2018-02-03",5,201805]
[null,null,"2018-02-04",5,201805]
[null,null,"2018-02-05",6,201806]
[null,null,"2018-02-06",6,201806]
[null,null,"2018-02-07",6,201806]
[null,null,"2018-02-08",6,201806]
[null,null,"2018-02-09",6,201806]
[null,null,"2018-02-10",6,201806]
[null,null,"2018-02-11",6,201806]
[null,null,"2018-02-12",7,201807]
[null,null,"2018-02-13",7,201807]
[null,null,"2018-02-14",7,201807]
[null,null,"2018-02-15",7,201807]
[null,null,"2018-02-16",7,201807]
[null,null,"2018-02-17",7,201807]
[null,null,"2018-02-18",7,201807]
[null,null,"2018-02-19",8,201808]
[null,null,"2018-02-20",8,201808]
[null,null,"2018-02-21",8,201808]
[null,null,"2018-02-22",8,201808]
[null,null,"2018-02-23",8,201808]
[null,null,"2018-02-24",8,201808]
[null,null,"2018-02-25",8,201808]
[null,null,"2018-02-26",9,201809]
[null,null,"2018-02-27",9,201809]
[null,null,"2018-02-28",9,201809]
[null,null,"2018-03-01",9,201809]
[null,null,"2018-03-02",9,201809]
[null,null,"2018-03-03",9,201809]
[null,null,"2018-03-04",9,201809]
[null,null,"2018-03-05",10,201810]
[null,null,"2018-03-06",10,201810]
[null,null,"2018-03-07",10,201810]
[null,null,"2018-03-08",10,201810]
[null,null,"2018-03-09",10,201810]
[null,null,"2018-03-10",10,201810]
[null,null,"2018-03-11",10,201810]
[null,null,"2018-03-12",11,201811]
[null,null,"2018-03-13",11,201811]
[null,null,"2018-03-14",11,201811]
[null,null,"2018-03-15",11,201811]
[null,null,"2018-03-16",11,201811]
[null,null,"2018-03-17",11,201811]
[null,null,"2018-03-18",11,201811]
[null,null,"2018-03-19",12,201812]
[null,null,"2018-03-20",12,201812]
[null,null,"2018-03-21",12,201812]
[null,null,"2018-03-22",12,201812]
[null,null,"2018-03-23",12,201812]
[null,null,"2018-03-24",12,201812]
[null,null,"2018-03-25",12,201812]
[null,null,"2018-03-26",13,201813]
[null,null,"2018-03-27",13,201813]
[null,null,"2018-03-28",13,201813]
[null,null,"2018-03-29",13,201813]
[null,null,"2018-03-30",13,201813]
[null,null,"2018-03-31",13,201813]
[null,null,"2018-04-01",13,201813]
[null,null,"2018-04-02",14,201814]
[null,null,"2018-04-03",14,201814]
[null,null,"2018-04-04",14,201814]
[null,null,"2018-04-05",14,201814]
[null,null,"2018-04-06",14,201814]
[null,null,"2018-04-07",14,201814]
[null,null,"2018-04-08",14,201814]
[null,null,"2018-04-09",15,201815]
[null,null,"2018-04-10",15,201815]
[null,null,"2018-04-11",15,201815]
[null,null,"2018-04-12",15,201815]
[null,null,"2018-04-13",15,201815]
[null,null,"2018-04-14",15,201815]
[null,null,"2018-04-15",15,201815]
[null,null,"2018-04-16",16,201816]
[null,null,"2018-04-17",16,201816]
[null,null,"2018-04-18",16,201816]
[null,null,"2018-04-19",16,201816]
[null,null,"2018-04-20",16,201816]
[null,null,"2018-04-21",16,201816]
[null,null,"2018-04-22",16,201816]
[null,null,"2018-04-23",17,201817]
[null,null,"2018-04-24",17,201817]
[null,null,"2018-04-25",17,201817]
[null,null,"2018-04-26",17,201817]
[null,null,"2018-04-27",17,201817]
[null,null,"2018-04-28",17,201817]
[null,null,"2018-04-29",17,201817]
[null,null,"2018-04-30",18,201818]
[null,null,"2018-05-01",18,201818]
[null,null,"2018-05-02",18,201818]
[null,null,"2018-05-03",18,201818]
[null,null,"2018-05-04",18,201818]
[null,null,"2018-05-05",18,201818]
[null,null,"2018-05-06",18,201818]
[null,null,"2018-05-07",19,201819]
[null,null,"2018-05-08",19,201819]
[null,null,"2018-05-09",19,201819]
[null,null,"2018-05-10",19,201819]
[null,null,"2018-05-11",19,201819]
[null,null,"2018-05-12",19,201819]
[null,null,"2018-05-13",19,201819]
[null,null,"2018-05-14",20,201820]
[null,null,"2018-05-15",20,201820]
[null,null,"2018-05-16",20,201820]
[null,null,"2018-05-17",20,201820]
[null,null,"2018-05-18",20,201820]
[null,null,"2018-05-19",20,201820]
[null,null,"2018-05-20",20,201820]
[null,null,"2018-05-21",21,201821]
[null,null,"2018-05-22",21,201821]
[null,null,"2018-05-23",21,201821]
[null,null,"2018-05-24",21,201821]
[null,null,"2018-05-25",21,201821]
[null,null,"2018-05-26",21,201821]
[null,null,"2018-05-27",21,201821]
[null,null,"2018-05-28",22,201822]
[null,null,"2018-05-29",22,201822]
[null,null,"2018-05-30",22,201822]
[null,null,"2018-05-31",22,201822]
[null,null,"2018-06-01",22,201822]
[null,null,"2018-06-02",22,201822]
[null,null,"2018-06-03",22,201822]
[null,null,"2018-06-04",23,201823]
[null,null,"2018-06-05",23,201823]
[null,null,"2018-06-06",23,201823]
[null,null,"2018-06-07",23,201823]
[null,null,"2018-06-08",23,201823]
[null,null,"2018-06-09",23,201823]
[null,null,"2018-06-10",23,201823]
[null,null,"2018-06-11",24,201824]
[null,null,"2018-06-12",24,201824]
[null,null,"2018-06-13",24,201824]
[null,null,"2018-06-14",24,201824]
[null,null,"2018-06-15",24,201824]
[null,null,"2018-06-16",24,201824]
[null,null,"2018-06-17",24,201824]
[null,null,"2018-06-18",25,201825]
[null,null,"2018-06-19",25,201825]
[null,null,"2018-06-20",25,201825]
[null,null,"2018-06-21",25,201825]
[null,null,"2018-06-22",25,201825]
[null,null,"2018-06-23",25,201825]
[null,null,"2018-06-24",25,201825]
[null,null,"2018-06-25",26,201826]
[null,null,"2018-06-26",26,201826]
[null,null,"2018-06-27",26,201826]
[null,null,"2018-06-28",26,201826]
[null,null,"2018-06-29",26,201826]
[null,null,"2018-06-30",26,201826]
[null,null,"2018-07-01",26,201826]
[null,null,"2018-07-02",27,201827]
[null,null,"2018-07-03",27,201827]
[null,null,"2018-07-04",27,201827]
[null,null,"2018-07-05",27,201827]
[null,null,"2018-07-06",27,201827]
[null,null,"2018-07-07",27,201827]
[null,null,"2018-07-08",27,201827]
[null,null,"2018-07-09",28,201828]
[null,null,"2018-07-10",28,201828]
[null,null,"2018-07-11",28,201828]
[null,null,"2018-07-12",28,201828]
[null,null,"2018-07-13",28,201828]
[null,null,"2018-07-14",28,201828]
[null,null,"2018-07-15",28,201828]
[null,null,"2018-07-16",29,201829]
[null,null,"2018-07-17",29,201829]
[null,null,"2018-07-18",29,201829]
[null,null,"2018-07-19",29,201829]
[null,null,"2018-07-20",29,201829]
[null,null,"2018-07-21",29,201829]
[null,null,"2018-07-22",29,201829]
[null,null,"2018-07-23",30,201830]
[null,null,"2018-07-24",30,201830]
[null,null,"2018-07-25",30,201830]
[null,null,"2018-07-26",30,201830]
[null,null,"2018-07-27",30,201830]
[null,null,"2018-07-28",30,201830]
[null,null,"2018-07-29",30,201830]
[null,null,"2018-07-30",31,201831]
[null,null,"2018-07-31",31,201831]
[null,null,"2018-08-01",31,201831]
[null,null,"2018-08-02",31,201831]
[null,null,"2018-08-03",31,201831]
[null,null,"2018-08-04",31,201831]
[null,null,"2018-08-05",31,201831]
[null,null,"2018-08-06",32,201832]
[null,null,"2018-08-07",32,201832]
[null,null,"2018-08-08",32,201832]
[null,null,"2018-08-09",32,201832]
[null,null,"2018-08-10",32,201832]
[null,null,"2018-08-11",32,201832]
[null,null,"2018-08-12",32,201832]
[null,null,"2018-08-13",33,201833]
[null,null,"2018-08-14",33,201833]
[null,null,"2018-08-15",33,201833]
[null,null,"2018-08-16",33,201833]
[null,null,"2018-08-17",33,201833]
[null,null,"2018-08-18",33,201833]
[null,null,"2018-08-19",33,201833]
[null,null,"2018-08-20",34,201834]
[null,null,"2018-08-21",34,201834]
[null,null,"2018-08-22",34,201834]
[null,null,"2018-08-23",34,201834]
[null,null,"2018-08-24",34,201834]
[null,null,"2018-08-25",34,201834]
[null,null,"2018-08-26",34,201834]
[null,null,"2018-08-27",35,201835]
[null,null,"2018-08-28",35,201835]
[null,null,"2018-08-29",35,201835]
[null,null,"2018-08-30",35,201835]
[null,null,"2018-08-31",35,201835]
[null,null,"2018-09-01",35,201835]
[null,null,"2018-09-02",35,201835]
[null,null,"2018-09-03",36,201836]
[null,null,"2018-09-04",36,201836]
[null,null,"2018-09-05",36,201836]
[null,null,"2018-09-06",36,201836]
[null,null,"2018-09-07",36,201836]
[null,null,"2018-09-08",36,201836]
[null,null,"2018-09-09",36,201836]
[null,null,"2018-09-10",37,201837]
[null,null,"2018-09-11",37,201837]
[null,null,"2018-09-12",37,201837]
[null,null,"2018-09-13",37,201837]
[null,null,"2018-09-14",37,201837]
[null,null,"2018-09-15",37,201837]
[null,null,"2018-09-16",37,201837]
[null,null,"2018-09-17",38,201838]
[null,null,"2018-09-18",38,201838]
[null,null,"2018-09-19",38,201838]
[null,null,"2018-09-20",38,201838]
[null,null,"2018-09-21",38,201838]
[null,null,"2018-09-22",38,201838]
[null,null,"2018-09-23",38,201838]
[null,null,"2018-09-24",39,201839]
[null,null,"2018-09-25",39,201839]
[null,null,"2018-09-26",39,201839]
[null,null,"2018-09-27",39,201839]
[null,null,"2018-09-28",39,201839]
[null,null,"2018-09-29",39,201839]
[null,null,"2018-09-30",39,201839]
[null,null,"2018-10-01",40,201840]
[null,null,"2018-10-02",40,201840]
[null,null,"2018-10-03",40,201840]
[null,null,"2018-10-04",40,201840]
[null,null,"2018-10-05",40,201840]
[null,null,"2018-10-06",40,201840]
[null,null,"2018-10-07",40,201840]
[null,null,"2018-10-08",41,201841]
[null,null,"2018-10-09",41,201841]
[null,null,"2018-10-10",41,201841]
[null,null,"2018-10-11",41,201841]
[null,null,"2018-10-12",41,201841]
[null,null,"2018-10-13",41,201841]
[null,null,"2018-10-14",41,201841]
[null,null,"2018-10-15",42,201842]
[null,null,"2018-10-16",42,201842]
[null,null,"2018-10-17",42,201842]
[null,null,"2018-10-18",42,201842]
[null,null,"2018-10-19",42,201842]
[null,null,"2018-10-20",42,201842]
[null,null,"2018-10-21",42,201842]
[null,null,"2018-10-22",43,201843]
[null,null,"2018-10-23",43,201843]
[null,null,"2018-10-24",43,201843]
[null,null,"2018-10-25",43,201843]
[null,null,"2018-10-26",43,201843]
[null,null,"2018-10-27",43,201843]
[null,null,"2018-10-28",43,201843]
[null,null,"2018-10-29",44,201844]
[null,null,"2018-10-30",44,201844]
[null,null,"2018-10-31",44,201844]
[null,null,"2018-11-01",44,201844]
[null,null,"2018-11-02",44,201844]
[null,null,"2018-11-03",44,201844]
[null,null,"2018-11-04",44,201844]
[null,null,"2018-11-05",45,201845]
[null,null,"2018-11-06",45,201845]
[null,null,"2018-11-07",45,201845]
[null,null,"2018-11-08",45,201845]
[null,null,"2018-11-09",45,201845]
[null,null,"2018-11-10",45,201845]
[null,null,"2018-11-11",45,201845]
[null,null,"2018-11-12",46,201846]
[null,null,"2018-11-13",46,201846]
[null,null,"2018-11-14",46,201846]
[null,null,"2018-11-15",46,201846]
[null,null,"2018-11-16",46,201846]
[null,null,"2018-11-17",46,201846]
[null,null,"2018-11-18",46,201846]
[null,null,"2018-11-19",47,201847]
[null,null,"2018-11-20",47,201847]
[null,null,"2018-11-21",47,201847]
[null,null,"2018-11-22",47,201847]
[null,null,"2018-11-23",47,201847]
[null,null,"2018-11-24",47,201847]
[null,null,"2018-11-25",47,201847]
[null,null,"2018-11-26",48,201848]
[null,null,"2018-11-27",48,201848]
[null,null,"2018-11-28",48,201848]
[null,null,"2018-11-29",48,201848]
[null,null,"2018-11-30",48,201848]
[null,null,"2018-12-01",48,201848]
[null,null,"2018-12-02",48,201848]
[null,null,"2018-12-03",49,201849]
[null,null,"2018-12-04",49,201849]
[null,null,"2018-12-05",49,201849]
[null,null,"2018-12-06",49,201849]
[null,null,"2018-12-07",49,201849]
[null,null,"2018-12-08",49,201849]
[null,null,"2018-12-09",49,201849]
[null,null,"2018-12-10",50,201850]
[null,null,"2018-12-11",50,201850]
[null,null,"2018-12-12",50,201850]
[null,null,"2018-12-13",50,201850]
[null,null,"2018-12-14",50,201850]
[null,null,"2018-12-15",50,201850]
[null,null,"2018-12-16",50,201850]
[null,null,"2018-12-17",51,201851]
[null,null,"2018-12-18",51,201851]
[null,null,"2018-12-19",51,201851]
[null,null,"2018-12-20",51,201851]
[null,null,"2018-12-21",51,201851]
[null,null,"2018-12-22",51,201851]
[null,null,"2018-12-23",51,201851]
[null,null,"2018-12-24",52,201852]
[null,null,"2018-12-25",52,201852]
[null,null,"2018-12-26",52,201852]
[null,null,"2018-12-27",52,201852]
[null,null,"2018-12-28",52,201852]
[null,null,"2018-12-29",52,201852]
[null,null,"2018-12-30",52,201852]
[null,null,"2018-12-31",52,201852]
[null,null,"2019-01-01",1,201901]
[null,null,"2019-01-02",1,201901]
[null,null,"2019-01-03",1,201901]
[null,null,"2019-01-04",1,201901]
[null,null,"2019-01-05",1,201901]
[null,null,"2019-01-06",1,201901]
[null,null,"2019-01-07",2,201902]
[null,null,"2019-01-08",2,201902]
[null,null,"2019-01-09",2,201902]
[null,null,"2019-01-10",2,201902]
[null,null,"2019-01-11",2,201902]
[null,null,"2019-01-12",2,201902]
[null,null,"2019-01-13",2,201902]
[null,null,"2019-01-14",3,201903]
[null,null,"2019-01-15",3,201903]
[null,null,"2019-01-16",3,201903]
[null,null,"2019-01-17",3,201903]
[null,null,"2019-01-18",3,201903]
[null,null,"2019-01-19",3,201903]
[null,null,"2019-01-20",3,201903]
[null,null,"2019-01-21",4,201904]
[null,null,"2019-01-22",4,201904]
[null,null,"2019-01-23",4,201904]
[null,null,"2019-01-24",4,201904]
[null,null,"2019-01-25",4,201904]
[null,null,"2019-01-26",4,201904]
[null,null,"2019-01-27",4,201904]
[null,null,"2019-01-28",5,201905]
[null,null,"2019-01-29",5,201905]
[null,null,"2019-01-30",5,201905]
[null,null,"2019-01-31",5,201905]
[null,null,"2019-02-01",5,201905]
[null,null,"2019-02-02",5,201905]
[null,null,"2019-02-03",5,201905]
[null,null,"2019-02-04",6,201906]
[null,null,"2019-02-05",6,201906]
[null,null,"2019-02-06",6,201906]
[null,null,"2019-02-07",6,201906]
[null,null,"2019-02-08",6,201906]
[null,null,"2019-02-09",6,201906]
[null,null,"2019-02-10",6,201906]
[null,null,"2019-02-11",7,201907]
[null,null,"2019-02-12",7,201907]
[null,null,"2019-02-13",7,201907]
[null,null,"2019-02-14",7,201907]
[null,null,"2019-02-15",7,201907]
[null,null,"2019-02-16",7,201907]
[null,null,"2019-02-17",7,201907]
[null,null,"2019-02-18",8,201908]
[null,null,"2019-02-19",8,201908]
[null,null,"2019-02-20",8,201908]
[null,null,"2019-02-21",8,201908]
[null,null,"2019-02-22",8,201908]
[null,null,"2019-02-23",8,201908]
[null,null,"2019-02-24",8,201908]
[null,null,"2019-02-25",9,201909]
[null,null,"2019-02-26",9,201909]
[null,null,"2019-02-27",9,201909]
[null,null,"2019-02-28",9,201909]
[null,null,"2019-03-01",9,201909]
[null,null,"2019-03-02",9,201909]
[null,null,"2019-03-03",9,201909]
[null,null,"2019-03-04",10,201910]
[null,null,"2019-03-05",10,201910]
[null,null,"2019-03-06",10,201910]
[null,null,"2019-03-07",10,201910]
[null,null,"2019-03-08",10,201910]
[null,null,"2019-03-09",10,201910]
[null,null,"2019-03-10",10,201910]
[null,null,"2019-03-11",11,201911]
[null,null,"2019-03-12",11,201911]
[null,null,"2019-03-13",11,201911]
[null,null,"2019-03-14",11,201911]
[null,null,"2019-03-15",11,201911]
[null,null,"2019-03-16",11,201911]
[null,null,"2019-03-17",11,201911]
[null,null,"2019-03-18",12,201912]
[null,null,"2019-03-19",12,201912]
[null,null,"2019-03-20",12,201912]
[null,null,"2019-03-21",12,201912]
[null,null,"2019-03-22",12,201912]
[null,null,"2019-03-23",12,201912]
[null,null,"2019-03-24",12,201912]
[null,null,"2019-03-25",13,201913]
[null,null,"2019-03-26",13,201913]
[null,null,"2019-03-27",13,201913]
[null,null,"2019-03-28",13,201913]
[null,null,"2019-03-29",13,201913]
[null,null,"2019-03-30",13,201913]
[null,null,"2019-03-31",13,201913]
[null,null,"2019-04-01",14,201914]
[null,null,"2019-04-02",14,201914]
[null,null,"2019-04-03",14,201914]
[null,null,"2019-04-04",14,201914]
[null,null,"2019-04-05",14,201914]
[null,null,"2019-04-06",14,201914]
[null,null,"2019-04-07",14,201914]
[null,null,"2019-04-08",15,201915]
[null,null,"2019-04-09",15,201915]
[null,null,"2019-04-10",15,201915]
[null,null,"2019-04-11",15,201915]
[null,null,"2019-04-12",15,201915]
[null,null,"2019-04-13",15,201915]
[null,null,"2019-04-14",15,201915]
[null,null,"2019-04-15",16,201916]
[null,null,"2019-04-16",16,201916]
[null,null,"2019-04-17",16,201916]
[null,null,"2019-04-18",16,201916]
[null,null,"2019-04-19",16,201916]
[null,null,"2019-04-20",16,201916]
[null,null,"2019-04-21",16,201916]
[null,null,"2019-04-22",17,201917]
[null,null,"2019-04-23",17,201917]
[null,null,"2019-04-24",17,201917]
[null,null,"2019-04-25",17,201917]
[null,null,"2019-04-26",17,201917]
[null,null,"2019-04-27",17,201917]
[null,null,"2019-04-28",17,201917]
[null,null,"2019-04-29",18,201918]
[null,null,"2019-04-30",18,201918]
[null,null,"2019-05-01",18,201918]
[null,null,"2019-05-02",18,201918]
[null,null,"2019-05-03",18,201918]
[null,null,"2019-05-04",18,201918]
[null,null,"2019-05-05",18,201918]
[null,null,"2019-05-06",19,201919]
[null,null,"2019-05-07",19,201919]
[null,null,"2019-05-08",19,201919]
[null,null,"2019-05-09",19,201919]
[null,null,"2019-05-10",19,201919]
[null,null,"2019-05-11",19,201919]
[null,null,"2019-05-12",19,201919]
[null,null,"2019-05-13",20,201920]
[null,null,"2019-05-14",20,201920]
[null,null,"2019-05-15",20,201920]
[null,null,"2019-05-16",20,201920]
[null,null,"2019-05-17",20,201920]
[null,null,"2019-05-18",20,201920]
[null,null,"2019-05-19",20,201920]
[null,null,"2019-05-20",21,201921]
[null,null,"2019-05-21",21,201921]
[null,null,"2019-05-22",21,201921]
[null,null,"2019-05-23",21,201921]
[null,null,"2019-05-24",21,201921]
[null,null,"2019-05-25",21,201921]
[null,null,"2019-05-26",21,201921]
[null,null,"2019-05-27",22,201922]
[null,null,"2019-05-28",22,201922]
[null,null,"2019-05-29",22,201922]
[null,null,"2019-05-30",22,201922]
[null,null,"2019-05-31",22,201922]
[null,null,"2019-06-01",22,201922]
[null,null,"2019-06-02",22,201922]
[null,null,"2019-06-03",23,201923]
[null,null,"2019-06-04",23,201923]
[null,null,"2019-06-05",23,201923]
[null,null,"2019-06-06",23,201923]
[null,null,"2019-06-07",23,201923]
[null,null,"2019-06-08",23,201923]
[null,null,"2019-06-09",23,201923]
[null,null,"2019-06-10",24,201924]
[null,null,"2019-06-11",24,201924]
[null,null,"2019-06-12",24,201924]
[null,null,"2019-06-13",24,201924]
[null,null,"2019-06-14",24,201924]
[null,null,"2019-06-15",24,201924]
[null,null,"2019-06-16",24,201924]
[null,null,"2019-06-17",25,201925]
[null,null,"2019-06-18",25,201925]
[null,null,"2019-06-19",25,201925]
[null,null,"2019-06-20",25,201925]
[null,null,"2019-06-21",25,201925]
[null,null,"2019-06-22",25,201925]
[null,null,"2019-06-23",25,201925]
[null,null,"2019-06-24",26,201926]
[null,null,"2019-06-25",26,201926]
[null,null,"2019-06-26",26,201926]
[null,null,"2019-06-27",26,201926]
[null,null,"2019-06-28",26,201926]
[null,null,"2019-06-29",26,201926]
[null,null,"2019-06-30",26,201926]
[null,null,"2019-07-01",27,201927]
[null,null,"2019-07-02",27,201927]
[null,null,"2019-07-03",27,201927]
[null,null,"2019-07-04",27,201927]
[null,null,"2019-07-05",27,201927]
[null,null,"2019-07-06",27,201927]
[null,null,"2019-07-07",27,201927]
[null,null,"2019-07-08",28,201928]
[null,null,"2019-07-09",28,201928]
[null,null,"2019-07-10",28,201928]
[null,null,"2019-07-11",28,201928]
[null,null,"2019-07-12",28,201928]
[null,null,"2019-07-13",28,201928]
[null,null,"2019-07-14",28,201928]
[null,null,"2019-07-15",29,201929]
[null,null,"2019-07-16",29,201929]
[null,null,"2019-07-17",29,201929]
[null,null,"2019-07-18",29,201929]
[null,null,"2019-07-19",29,201929]
[null,null,"2019-07-20",29,201929]
[null,null,"2019-07-21",29,201929]
[null,null,"2019-07-22",30,201930]
[null,null,"2019-07-23",30,201930]
[null,null,"2019-07-24",30,201930]
[null,null,"2019-07-25",30,201930]
[null,null,"2019-07-26",30,201930]
[null,null,"2019-07-27",30,201930]
[null,null,"2019-07-28",30,201930]
[null,null,"2019-07-29",31,201931]
[null,null,"2019-07-30",31,201931]
[null,null,"2019-07-31",31,201931]
[null,null,"2019-08-01",31,201931]
[null,null,"2019-08-02",31,201931]
[null,null,"2019-08-03",31,201931]
[null,null,"2019-08-04",31,201931]
[null,null,"2019-08-05",32,201932]
[null,null,"2019-08-06",32,201932]
[null,null,"2019-08-07",32,201932]
[null,null,"2019-08-08",32,201932]
[null,null,"2019-08-09",32,201932]
[null,null,"2019-08-10",32,201932]
[null,null,"2019-08-11",32,201932]
[null,null,"2019-08-12",33,201933]
[null,null,"2019-08-13",33,201933]
[null,null,"2019-08-14",33,201933]
[null,null,"2019-08-15",33,201933]
[null,null,"2019-08-16",33,201933]
[null,null,"2019-08-17",33,201933]
[null,null,"2019-08-18",33,201933]
[null,null,"2019-08-19",34,201934]
[null,null,"2019-08-20",34,201934]
[null,null,"2019-08-21",34,201934]
[null,null,"2019-08-22",34,201934]
[null,null,"2019-08-23",34,201934]
[null,null,"2019-08-24",34,201934]
[null,null,"2019-08-25",34,201934]
[null,null,"2019-08-26",35,201935]
[null,null,"2019-08-27",35,201935]
[null,null,"2019-08-28",35,201935]
[null,null,"2019-08-29",35,201935]
[null,null,"2019-08-30",35,201935]
[null,null,"2019-08-31",35,201935]
[null,null,"2019-09-01",35,201935]
[null,null,"2019-09-02",36,201936]
[null,null,"2019-09-03",36,201936]
[null,null,"2019-09-04",36,201936]
[null,null,"2019-09-05",36,201936]
[null,null,"2019-09-06",36,201936]
[null,null,"2019-09-07",36,201936]
[null,null,"2019-09-08",36,201936]
[null,null,"2019-09-09",37,201937]
[null,null,"2019-09-10",37,201937]
[null,null,"2019-09-11",37,201937]
[null,null,"2019-09-12",37,201937]
[null,null,"2019-09-13",37,201937]
[null,null,"2019-09-14",37,201937]
[null,null,"2019-09-15",37,201937]
[null,null,"2019-09-16",38,201938]
[null,null,"2019-09-17",38,201938]
[null,null,"2019-09-18",38,201938]
[null,null,"2019-09-19",38,201938]
[null,null,"2019-09-20",38,201938]
[null,null,"2019-09-21",38,201938]
[null,null,"2019-09-22",38,201938]
[null,null,"2019-09-23",39,201939]
[null,null,"2019-09-24",39,201939]
[null,null,"2019-09-25",39,201939]
[null,null,"2019-09-26",39,201939]
[null,null,"2019-09-27",39,201939]
[null,null,"2019-09-28",39,201939]
[null,null,"2019-09-29",39,201939]
[null,null,"2019-09-30",40,201940]
[null,null,"2019-10-01",40,201940]
[null,null,"2019-10-02",40,201940]
[null,null,"2019-10-03",40,201940]
[null,null,"2019-10-04",40,201940]
[null,null,"2019-10-05",40,201940]
[null,null,"2019-10-06",40,201940]
[null,null,"2019-10-07",41,201941]
[null,null,"2019-10-08",41,201941]
[null,null,"2019-10-09",41,201941]
[null,null,"2019-10-10",41,201941]
[null,null,"2019-10-11",41,201941]
[null,null,"2019-10-12",41,201941]
[null,null,"2019-10-13",41,201941]
[null,null,"2019-10-14",42,201942]
[null,null,"2019-10-15",42,201942]
[null,null,"2019-10-16",42,201942]
[null,null,"2019-10-17",42,201942]
[null,null,"2019-10-18",42,201942]
[null,null,"2019-10-19",42,201942]
[null,null,"2019-10-20",42,201942]
[null,null,"2019-10-21",43,201943]
[null,null,"2019-10-22",43,201943]
[null,null,"2019-10-23",43,201943]
[null,null,"2019-10-24",43,201943]
[null,null,"2019-10-25",43,201943]
[null,null,"2019-10-26",43,201943]
[null,null,"2019-10-27",43,201943]
[null,null,"2019-10-28",44,201944]
[null,null,"2019-10-29",44,201944]
[null,null,"2019-10-30",44,201944]
[null,null,"2019-10-31",44,201944]
[null,null,"2019-11-01",44,201944]
[null,null,"2019-11-02",44,201944]
[null,null,"2019-11-03",44,201944]
[null,null,"2019-11-04",45,201945]
[null,null,"2019-11-05",45,201945]
[null,null,"2019-11-06",45,201945]
[null,null,"2019-11-07",45,201945]
[null,null,"2019-11-08",45,201945]
[null,null,"2019-11-09",45,201945]
[null,null,"2019-11-10",45,201945]
[null,null,"2019-11-11",46,201946]
[null,null,"2019-11-12",46,201946]
[null,null,"2019-11-13",46,201946]
[null,null,"2019-11-14",46,201946]
[null,null,"2019-11-15",46,201946]
[null,null,"2019-11-16",46,201946]
[null,null,"2019-11-17",46,201946]
[null,null,"2019-11-18",47,201947]
[null,null,"2019-11-19",47,201947]
[null,null,"2019-11-20",47,201947]
[null,null,"2019-11-21",47,201947]
[null,null,"2019-11-22",47,201947]
[null,null,"2019-11-23",47,201947]
[null,null,"2019-11-24",47,201947]
[null,null,"2019-11-25",48,201948]
[null,null,"2019-11-26",48,201948]
[null,null,"2019-11-27",48,201948]
[null,null,"2019-11-28",48,201948]
[null,null,"2019-11-29",48,201948]
[null,null,"2019-11-30",48,201948]
[null,null,"2019-12-01",48,201948]
[null,null,"2019-12-02",49,201949]
[null,null,"2019-12-03",49,201949]
[null,null,"2019-12-04",49,201949]
[null,null,"2019-12-05",49,201949]
[null,null,"2019-12-06",49,201949]
[null,null,"2019-12-07",49,201949]
[null,null,"2019-12-08",49,201949]
[null,null,"2019-12-09",50,201950]
[null,null,"2019-12-10",50,201950]
[null,null,"2019-12-11",50,201950]
[null,null,"2019-12-12",50,201950]
[null,null,"2019-12-13",50,201950]
[null,null,"2019-12-14",50,201950]
[null,null,"2019-12-15",50,201950]
[null,null,"2019-12-16",51,201951]
[null,null,"2019-12-17",51,201951]
[null,null,"2019-12-18",51,201951]
[null,null,"2019-12-19",51,201951]
[null,null,"2019-12-20",51,201951]
[null,null,"2019-12-21",51,201951]
[null,null,"2019-12-22",51,201951]
[null,null,"2019-12-23",52,201952]
[null,null,"2019-12-24",52,201952]
[null,null,"2019-12-25",52,201952]
[null,null,"2019-12-26",52,201952]
[null,null,"2019-12-27",52,201952]
[null,null,"2019-12-28",52,201952]
[null,null,"2019-12-29",52,201952]
[null,null,"2019-12-30",52,201952]
[null,null,"2019-12-31",52,201952]
[null,null,"2020-01-01",1,202001]
[null,null,"2020-01-02",1,202001]
[null,null,"2020-01-03",1,202001]
[null,null,"2020-01-04",1,202001]
[null,null,"2020-01-05",1,202001]
[null,null,"2020-01-06",2,202002]
[null,null,"2020-01-07",2,202002]
[null,null,"2020-01-08",2,202002]
[null,null,"2020-01-09",2,202002]
[null,null,"2020-01-10",2,202002]
[null,null,"2020-01-11",2,202002]
[null,null,"2020-01-12",2,202002]
[null,null,"2020-01-13",3,202003]
[null,null,"2020-01-14",3,202003]
[null,null,"2020-01-15",3,202003]
[null,null,"2020-01-16",3,202003]
[null,null,"2020-01-17",3,202003]
[null,null,"2020-01-18",3,202003]
[null,null,"2020-01-19",3,202003]
[null,null,"2020-01-20",4,202004]
[null,null,"2020-01-21",4,202004]
[null,null,"2020-01-22",4,202004]
[null,null,"2020-01-23",4,202004]
[null,null,"2020-01-24",4,202004]
[null,null,"2020-01-25",4,202004]
[null,null,"2020-01-26",4,202004]
[null,null,"2020-01-27",5,202005]
[null,null,"2020-01-28",5,202005]
[null,null,"2020-01-29",5,202005]
[null,null,"2020-01-30",5,202005]
[null,null,"2020-01-31",5,202005]
[null,null,"2020-02-01",5,202005]
[null,null,"2020-02-02",5,202005]
[null,null,"2020-02-03",6,202006]
[null,null,"2020-02-04",6,202006]
[null,null,"2020-02-05",6,202006]
[null,null,"2020-02-06",6,202006]
[null,null,"2020-02-07",6,202006]
[null,null,"2020-02-08",6,202006]
[null,null,"2020-02-09",6,202006]
[null,null,"2020-02-10",7,202007]
[null,null,"2020-02-11",7,202007]
[null,null,"2020-02-12",7,202007]
[null,null,"2020-02-13",7,202007]
[null,null,"2020-02-14",7,202007]
[null,null,"2020-02-15",7,202007]
[null,null,"2020-02-16",7,202007]
[null,null,"2020-02-17",8,202008]
[null,null,"2020-02-18",8,202008]
[null,null,"2020-02-19",8,202008]
[null,null,"2020-02-20",8,202008]
[null,null,"2020-02-21",8,202008]
[null,null,"2020-02-22",8,202008]
[null,null,"2020-02-23",8,202008]
[null,null,"2020-02-24",9,202009]
[null,null,"2020-02-25",9,202009]
[null,null,"2020-02-26",9,202009]
[null,null,"2020-02-27",9,202009]
[null,null,"2020-02-28",9,202009]
[null,null,"2020-02-29",9,202009]
[null,null,"2020-03-01",9,202009]
[null,null,"2020-03-02",10,202010]
[null,null,"2020-03-03",10,202010]
[null,null,"2020-03-04",10,202010]
[null,null,"2020-03-05",10,202010]
[null,null,"2020-03-06",10,202010]
[null,null,"2020-03-07",10,202010]
[null,null,"2020-03-08",10,202010]
[null,null,"2020-03-09",11,202011]
[null,null,"2020-03-10",11,202011]
[null,null,"2020-03-11",11,202011]
[null,null,"2020-03-12",11,202011]
[null,null,"2020-03-13",11,202011]
[null,null,"2020-03-14",11,202011]
[null,null,"2020-03-15",11,202011]
[null,null,"2020-03-16",12,202012]
[null,null,"2020-03-17",12,202012]
[null,null,"2020-03-18",12,202012]
[null,null,"2020-03-19",12,202012]
[null,null,"2020-03-20",12,202012]
[null,null,"2020-03-21",12,202012]
[null,null,"2020-03-22",12,202012]
[null,null,"2020-03-23",13,202013]
[null,null,"2020-03-24",13,202013]
[null,null,"2020-03-25",13,202013]
[null,null,"2020-03-26",13,202013]
[null,null,"2020-03-27",13,202013]
[null,null,"2020-03-28",13,202013]
[null,null,"2020-03-29",13,202013]
[null,null,"2020-03-30",14,202014]
[null,null,"2020-03-31",14,202014]
[null,null,"2020-04-01",14,202014]
[null,null,"2020-04-02",14,202014]
[null,null,"2020-04-03",14,202014]
[null,null,"2020-04-04",14,202014]
[null,null,"2020-04-05",14,202014]
[null,null,"2020-04-06",15,202015]
[null,null,"2020-04-07",15,202015]
[null,null,"2020-04-08",15,202015]
[null,null,"2020-04-09",15,202015]
[null,null,"2020-04-10",15,202015]
[null,null,"2020-04-11",15,202015]
[null,null,"2020-04-12",15,202015]
[null,null,"2020-04-13",16,202016]
[null,null,"2020-04-14",16,202016]
[null,null,"2020-04-15",16,202016]
[null,null,"2020-04-16",16,202016]
[null,null,"2020-04-17",16,202016]
[null,null,"2020-04-18",16,202016]
[null,null,"2020-04-19",16,202016]
[null,null,"2020-04-20",17,202017]
[null,null,"2020-04-21",17,202017]
[null,null,"2020-04-22",17,202017]
[null,null,"2020-04-23",17,202017]
[null,null,"2020-04-24",17,202017]
[null,null,"2020-04-25",17,202017]
[null,null,"2020-04-26",17,202017]
[null,null,"2020-04-27",18,202018]
[null,null,"2020-04-28",18,202018]
[null,null,"2020-04-29",18,202018]
[null,null,"2020-04-30",18,202018]
[null,null,"2020-05-01",18,202018]
[null,null,"2020-05-02",18,202018]
[null,null,"2020-05-03",18,202018]
[null,null,"2020-05-04",19,202019]
[null,null,"2020-05-05",19,202019]
[null,null,"2020-05-06",19,202019]
[null,null,"2020-05-07",19,202019]
[null,null,"2020-05-08",19,202019]
[null,null,"2020-05-09",19,202019]
[null,null,"2020-05-10",19,202019]
[null,null,"2020-05-11",20,202020]
[null,null,"2020-05-12",20,202020]
[null,null,"2020-05-13",20,202020]
[null,null,"2020-05-14",20,202020]
[null,null,"2020-05-15",20,202020]
[null,null,"2020-05-16",20,202020]
[null,null,"2020-05-17",20,202020]
[null,null,"2020-05-18",21,202021]
[null,null,"2020-05-19",21,202021]
[null,null,"2020-05-20",21,202021]
[null,null,"2020-05-21",21,202021]
[null,null,"2020-05-22",21,202021]
[null,null,"2020-05-23",21,202021]
[null,null,"2020-05-24",21,202021]
[null,null,"2020-05-25",22,202022]
[null,null,"2020-05-26",22,202022]
[null,null,"2020-05-27",22,202022]
[null,null,"2020-05-28",22,202022]
[null,null,"2020-05-29",22,202022]
[null,null,"2020-05-30",22,202022]
[null,null,"2020-05-31",22,202022]
[null,null,"2020-06-01",23,202023]
[null,null,"2020-06-02",23,202023]
[null,null,"2020-06-03",23,202023]
[null,null,"2020-06-04",23,202023]
[null,null,"2020-06-05",23,202023]
[null,null,"2020-06-06",23,202023]
[null,null,"2020-06-07",23,202023]
[null,null,"2020-06-08",24,202024]
[null,null,"2020-06-09",24,202024]
[null,null,"2020-06-10",24,202024]
[null,null,"2020-06-11",24,202024]
[null,null,"2020-06-12",24,202024]
[null,null,"2020-06-13",24,202024]
[null,null,"2020-06-14",24,202024]
[null,null,"2020-06-15",25,202025]
[null,null,"2020-06-16",25,202025]
[null,null,"2020-06-17",25,202025]
[null,null,"2020-06-18",25,202025]
[null,null,"2020-06-19",25,202025]
[null,null,"2020-06-20",25,202025]
[null,null,"2020-06-21",25,202025]
[null,null,"2020-06-22",26,202026]
[null,null,"2020-06-23",26,202026]
[null,null,"2020-06-24",26,202026]
[null,null,"2020-06-25",26,202026]
[null,null,"2020-06-26",26,202026]
[null,null,"2020-06-27",26,202026]
[null,null,"2020-06-28",26,202026]
[null,null,"2020-06-29",27,202027]
[null,null,"2020-06-30",27,202027]
[null,null,"2020-07-01",27,202027]
[null,null,"2020-07-02",27,202027]
[null,null,"2020-07-03",27,202027]
[null,null,"2020-07-04",27,202027]
[null,null,"2020-07-05",27,202027]
[null,null,"2020-07-06",28,202028]
[null,null,"2020-07-07",28,202028]
[null,null,"2020-07-08",28,202028]
[null,null,"2020-07-09",28,202028]
[null,null,"2020-07-10",28,202028]
[null,null,"2020-07-11",28,202028]
[null,null,"2020-07-12",28,202028]
[null,null,"2020-07-13",29,202029]
[null,null,"2020-07-14",29,202029]
[null,null,"2020-07-15",29,202029]
[null,null,"2020-07-16",29,202029]
[null,null,"2020-07-17",29,202029]
[null,null,"2020-07-18",29,202029]
[null,null,"2020-07-19",29,202029]
[null,null,"2020-07-20",30,202030]
[null,null,"2020-07-21",30,202030]
[null,null,"2020-07-22",30,202030]
[null,null,"2020-07-23",30,202030]
[null,null,"2020-07-24",30,202030]
[null,null,"2020-07-25",30,202030]
[null,null,"2020-07-26",30,202030]
[null,null,"2020-07-27",31,202031]
[null,null,"2020-07-28",31,202031]
[null,null,"2020-07-29",31,202031]
[null,null,"2020-07-30",31,202031]
[null,null,"2020-07-31",31,202031]
[null,null,"2020-08-01",31,202031]
[null,null,"2020-08-02",31,202031]
[null,null,"2020-08-03",32,202032]
[null,null,"2020-08-04",32,202032]
[null,null,"2020-08-05",32,202032]
[null,null,"2020-08-06",32,202032]
[null,null,"2020-08-07",32,202032]
[null,null,"2020-08-08",32,202032]
[null,null,"2020-08-09",32,202032]
[null,null,"2020-08-10",33,202033]
[null,null,"2020-08-11",33,202033]
[null,null,"2020-08-12",33,202033]
[null,null,"2020-08-13",33,202033]
[null,null,"2020-08-14",33,202033]
[null,null,"2020-08-15",33,202033]
[null,null,"2020-08-16",33,202033]
[null,null,"2020-08-17",34,202034]
[null,null,"2020-08-18",34,202034]
[null,null,"2020-08-19",34,202034]
[null,null,"2020-08-20",34,202034]
[null,null,"2020-08-21",34,202034]
[null,null,"2020-08-22",34,202034]
[null,null,"2020-08-23",34,202034]
[null,null,"2020-08-24",35,202035]
[null,null,"2020-08-25",35,202035]
[null,null,"2020-08-26",35,202035]
[null,null,"2020-08-27",35,202035]
[null,null,"2020-08-28",35,202035]
[null,null,"2020-08-29",35,202035]
[null,null,"2020-08-30",35,202035]
[null,null,"2020-08-31",36,202036]
[null,null,"2020-09-01",36,202036]
[null,null,"2020-09-02",36,202036]
[null,null,"2020-09-03",36,202036]
[null,null,"2020-09-04",36,202036]
[null,null,"2020-09-05",36,202036]
[null,null,"2020-09-06",36,202036]
[null,null,"2020-09-07",37,202037]
[null,null,"2020-09-08",37,202037]
[null,null,"2020-09-09",37,202037]
[null,null,"2020-09-10",37,202037]
[null,null,"2020-09-11",37,202037]
[null,null,"2020-09-12",37,202037]
[null,null,"2020-09-13",37,202037]
[null,null,"2020-09-14",38,202038]
[null,null,"2020-09-15",38,202038]
[null,null,"2020-09-16",38,202038]
[null,null,"2020-09-17",38,202038]
[null,null,"2020-09-18",38,202038]
[null,null,"2020-09-19",38,202038]
[null,null,"2020-09-20",38,202038]
[null,null,"2020-09-21",39,202039]
[null,null,"2020-09-22",39,202039]
[null,null,"2020-09-23",39,202039]
[null,null,"2020-09-24",39,202039]
[null,null,"2020-09-25",39,202039]
[null,null,"2020-09-26",39,202039]
[null,null,"2020-09-27",39,202039]
[null,null,"2020-09-28",40,202040]
[null,null,"2020-09-29",40,202040]
[null,null,"2020-09-30",40,202040]
[null,null,"2020-10-01",40,202040]
[null,null,"2020-10-02",40,202040]
[null,null,"2020-10-03",40,202040]
[null,null,"2020-10-04",40,202040]
[null,null,"2020-10-05",41,202041]
[null,null,"2020-10-06",41,202041]
[null,null,"2020-10-07",41,202041]
[null,null,"2020-10-08",41,202041]
[null,null,"2020-10-09",41,202041]
[null,null,"2020-10-10",41,202041]
[null,null,"2020-10-11",41,202041]
[null,null,"2020-10-12",42,202042]
[null,null,"2020-10-13",42,202042]
[null,null,"2020-10-14",42,202042]
[null,null,"2020-10-15",42,202042]
[null,null,"2020-10-16",42,202042]
[null,null,"2020-10-17",42,202042]
[null,null,"2020-10-18",42,202042]
[null,null,"2020-10-19",43,202043]
[null,null,"2020-10-20",43,202043]
[null,null,"2020-10-21",43,202043]
[null,null,"2020-10-22",43,202043]
[null,null,"2020-10-23",43,202043]
[null,null,"2020-10-24",43,202043]
[null,null,"2020-10-25",43,202043]
[null,null,"2020-10-26",44,202044]
[null,null,"2020-10-27",44,202044]
[null,null,"2020-10-28",44,202044]
[null,null,"2020-10-29",44,202044]
[null,null,"2020-10-30",44,202044]
[null,null,"2020-10-31",44,202044]
[null,null,"2020-11-01",44,202044]
[null,null,"2020-11-02",45,202045]
[null,null,"2020-11-03",45,202045]
[null,null,"2020-11-04",45,202045]
[null,null,"2020-11-05",45,202045]
[null,null,"2020-11-06",45,202045]
[null,null,"2020-11-07",45,202045]
[null,null,"2020-11-08",45,202045]
[null,null,"2020-11-09",46,202046]
[null,null,"2020-11-10",46,202046]
[null,null,"2020-11-11",46,202046]
[null,null,"2020-11-12",46,202046]
[null,null,"2020-11-13",46,202046]
[null,null,"2020-11-14",46,202046]
[null,null,"2020-11-15",46,202046]
[null,null,"2020-11-16",47,202047]
[null,null,"2020-11-17",47,202047]
[null,null,"2020-11-18",47,202047]
[null,null,"2020-11-19",47,202047]
[null,null,"2020-11-20",47,202047]
[null,null,"2020-11-21",47,202047]
[null,null,"2020-11-22",47,202047]
[null,null,"2020-11-23",48,202048]
[null,null,"2020-11-24",48,202048]
[null,null,"2020-11-25",48,202048]
[null,null,"2020-11-26",48,202048]
[null,null,"2020-11-27",48,202048]
[null,null,"2020-11-28",48,202048]
[null,null,"2020-11-29",48,202048]
[null,null,"2020-11-30",49,202049]
[null,null,"2020-12-01",49,202049]
[null,null,"2020-12-02",49,202049]
[null,null,"2020-12-03",49,202049]
[null,null,"2020-12-04",49,202049]
[null,null,"2020-12-05",49,202049]
[null,null,"2020-12-06",49,202049]
[null,null,"2020-12-07",50,202050]
[null,null,"2020-12-08",50,202050]
[null,null,"2020-12-09",50,202050]
[null,null,"2020-12-10",50,202050]
[null,null,"2020-12-11",50,202050]
[null,null,"2020-12-12",50,202050]
[null,null,"2020-12-13",50,202050]
[null,null,"2020-12-14",51,202051]
[null,null,"2020-12-15",51,202051]
[null,null,"2020-12-16",51,202051]
[null,null,"2020-12-17",51,202051]
[null,null,"2020-12-18",51,202051]
[null,null,"2020-12-19",51,202051]
[null,null,"2020-12-20",51,202051]
[null,null,"2020-12-21",52,202052]
[null,null,"2020-12-22",52,202052]
[null,null,"2020-12-23",52,202052]
[null,null,"2020-12-24",52,202052]
[null,null,"2020-12-25",52,202052]
[null,null,"2020-12-26",52,202052]
[null,null,"2020-12-27",52,202052]
[null,null,"2020-12-28",53,202053]
[null,null,"2020-12-29",53,202053]
[null,null,"2020-12-30",53,202053]
[null,null,"2020-12-31",53,202053]
[null,null,"2021-01-01",1,202101]
[null,null,"2021-01-02",1,202101]
[null,null,"2021-01-03",1,202101]
[null,null,"2021-01-04",1,202101]
[null,null,"2021-01-05",1,202101]
[null,null,"2021-01-06",1,202101]
[null,null,"2021-01-07",1,202101]
[null,null,"2021-01-08",1,202101]
[null,null,"2021-01-09",1,202101]
[null,null,"2021-01-10",1,202101]
[null,null,"2021-01-11",2,202102]
[null,null,"2021-01-12",2,202102]
[null,null,"2021-01-13",2,202102]
[null,null,"2021-01-14",2,202102]
[null,null,"2021-01-15",2,202102]
[null,null,"2021-01-16",2,202102]
[null,null,"2021-01-17",2,202102]
[null,null,"2021-01-18",3,202103]
[null,null,"2021-01-19",3,202103]
[null,null,"2021-01-20",3,202103]
[null,null,"2021-01-21",3,202103]
[null,null,"2021-01-22",3,202103]
[null,null,"2021-01-23",3,202103]
[null,null,"2021-01-24",3,202103]
[null,null,"2021-01-25",4,202104]
[null,null,"2021-01-26",4,202104]
[null,null,"2021-01-27",4,202104]
[null,null,"2021-01-28",4,202104]
[null,null,"2021-01-29",4,202104]
[null,null,"2021-01-30",4,202104]
[null,null,"2021-01-31",4,202104]
[null,null,"2021-02-01",5,202105]
[null,null,"2021-02-02",5,202105]
[null,null,"2021-02-03",5,202105]
[null,null,"2021-02-04",5,202105]
[null,null,"2021-02-05",5,202105]
[null,null,"2021-02-06",5,202105]
[null,null,"2021-02-07",5,202105]
[null,null,"2021-02-08",6,202106]
[null,null,"2021-02-09",6,202106]
[null,null,"2021-02-10",6,202106]
[null,null,"2021-02-11",6,202106]
[null,null,"2021-02-12",6,202106]
[null,null,"2021-02-13",6,202106]
[null,null,"2021-02-14",6,202106]
[null,null,"2021-02-15",7,202107]
[null,null,"2021-02-16",7,202107]
[null,null,"2021-02-17",7,202107]
[null,null,"2021-02-18",7,202107]
[null,null,"2021-02-19",7,202107]
[null,null,"2021-02-20",7,202107]
[null,null,"2021-02-21",7,202107]
[null,null,"2021-02-22",8,202108]
[null,null,"2021-02-23",8,202108]
[null,null,"2021-02-24",8,202108]
[null,null,"2021-02-25",8,202108]
[null,null,"2021-02-26",8,202108]
[null,null,"2021-02-27",8,202108]
[null,null,"2021-02-28",8,202108]
[null,null,"2021-03-01",9,202109]
[null,null,"2021-03-02",9,202109]
[null,null,"2021-03-03",9,202109]
[null,null,"2021-03-04",9,202109]
[null,null,"2021-03-05",9,202109]
[null,null,"2021-03-06",9,202109]
[null,null,"2021-03-07",9,202109]
[null,null,"2021-03-08",10,202110]
[null,null,"2021-03-09",10,202110]
[null,null,"2021-03-10",10,202110]
[null,null,"2021-03-11",10,202110]
[null,null,"2021-03-12",10,202110]
[null,null,"2021-03-13",10,202110]
[null,null,"2021-03-14",10,202110]
[null,null,"2021-03-15",11,202111]
[null,null,"2021-03-16",11,202111]
[null,null,"2021-03-17",11,202111]
[null,null,"2021-03-18",11,202111]
[null,null,"2021-03-19",11,202111]
[null,null,"2021-03-20",11,202111]
[null,null,"2021-03-21",11,202111]
[null,null,"2021-03-22",12,202112]
[null,null,"2021-03-23",12,202112]
[null,null,"2021-03-24",12,202112]
[null,null,"2021-03-25",12,202112]
[null,null,"2021-03-26",12,202112]
[null,null,"2021-03-27",12,202112]
[null,null,"2021-03-28",12,202112]
[null,null,"2021-03-29",13,202113]
[null,null,"2021-03-30",13,202113]
[null,null,"2021-03-31",13,202113]
[null,null,"2021-04-01",13,202113]
[null,null,"2021-04-02",13,202113]
[null,null,"2021-04-03",13,202113]
[null,null,"2021-04-04",13,202113]
[null,null,"2021-04-05",14,202114]
[null,null,"2021-04-06",14,202114]
[null,null,"2021-04-07",14,202114]
[null,null,"2021-04-08",14,202114]
[null,null,"2021-04-09",14,202114]
[null,null,"2021-04-10",14,202114]
[null,null,"2021-04-11",14,202114]
[null,null,"2021-04-12",15,202115]
[null,null,"2021-04-13",15,202115]
[null,null,"2021-04-14",15,202115]
[null,null,"2021-04-15",15,202115]
[null,null,"2021-04-16",15,202115]
[null,null,"2021-04-17",15,202115]
[null,null,"2021-04-18",15,202115]
[null,null,"2021-04-19",16,202116]
[null,null,"2021-04-20",16,202116]
[null,null,"2021-04-21",16,202116]
[null,null,"2021-04-22",16,202116]
[null,null,"2021-04-23",16,202116]
[null,null,"2021-04-24",16,202116]
[null,null,"2021-04-25",16,202116]
[null,null,"2021-04-26",17,202117]
[null,null,"2021-04-27",17,202117]
[null,null,"2021-04-28",17,202117]
[null,null,"2021-04-29",17,202117]
[null,null,"2021-04-30",17,202117]
[null,null,"2021-05-01",17,202117]
[null,null,"2021-05-02",17,202117]
[null,null,"2021-05-03",18,202118]
[null,null,"2021-05-04",18,202118]
[null,null,"2021-05-05",18,202118]
[null,null,"2021-05-06",18,202118]
[null,null,"2021-05-07",18,202118]
[null,null,"2021-05-08",18,202118]
[null,null,"2021-05-09",18,202118]
[null,null,"2021-05-10",19,202119]
[null,null,"2021-05-11",19,202119]
[null,null,"2021-05-12",19,202119]
[null,null,"2021-05-13",19,202119]
[null,null,"2021-05-14",19,202119]
[null,null,"2021-05-15",19,202119]
[null,null,"2021-05-16",19,202119]
[null,null,"2021-05-17",20,202120]
[null,null,"2021-05-18",20,202120]
[null,null,"2021-05-19",20,202120]
[null,null,"2021-05-20",20,202120]
[null,null,"2021-05-21",20,202120]
[null,null,"2021-05-22",20,202120]
[null,null,"2021-05-23",20,202120]
[null,null,"2021-05-24",21,202121]
[null,null,"2021-05-25",21,202121]
[null,null,"2021-05-26",21,202121]
[null,null,"2021-05-27",21,202121]
[null,null,"2021-05-28",21,202121]
[null,null,"2021-05-29",21,202121]
[null,null,"2021-05-30",21,202121]
[null,null,"2021-05-31",22,202122]
[null,null,"2021-06-01",22,202122]
[null,null,"2021-06-02",22,202122]
[null,null,"2021-06-03",22,202122]
[null,null,"2021-06-04",22,202122]
[null,null,"2021-06-05",22,202122]
[null,null,"2021-06-06",22,202122]
[null,null,"2021-06-07",23,202123]
[null,null,"2021-06-08",23,202123]
[null,null,"2021-06-09",23,202123]
[null,null,"2021-06-10",23,202123]
[null,null,"2021-06-11",23,202123]
[null,null,"2021-06-12",23,202123]
[null,null,"2021-06-13",23,202123]
[null,null,"2021-06-14",24,202124]
[null,null,"2021-06-15",24,202124]
[null,null,"2021-06-16",24,202124]
[null,null,"2021-06-17",24,202124]
[null,null,"2021-06-18",24,202124]
[null,null,"2021-06-19",24,202124]
[null,null,"2021-06-20",24,202124]
[null,null,"2021-06-21",25,202125]
[null,null,"2021-06-22",25,202125]
[null,null,"2021-06-23",25,202125]
[null,null,"2021-06-24",25,202125]
[null,null,"2021-06-25",25,202125]
[null,null,"2021-06-26",25,202125]
[null,null,"2021-06-27",25,202125]
[null,null,"2021-06-28",26,202126]
[null,null,"2021-06-29",26,202126]
[null,null,"2021-06-30",26,202126]
[null,null,"2021-07-01",26,202126]
[null,null,"2021-07-02",26,202126]
[null,null,"2021-07-03",26,202126]
[null,null,"2021-07-04",26,202126]
[null,null,"2021-07-05",27,202127]
[null,null,"2021-07-06",27,202127]
[null,null,"2021-07-07",27,202127]
[null,null,"2021-07-08",27,202127]
[null,null,"2021-07-09",27,202127]
[null,null,"2021-07-10",27,202127]
[null,null,"2021-07-11",27,202127]
[null,null,"2021-07-12",28,202128]
[null,null,"2021-07-13",28,202128]
[null,null,"2021-07-14",28,202128]
[null,null,"2021-07-15",28,202128]
[null,null,"2021-07-16",28,202128]
[null,null,"2021-07-17",28,202128]
[null,null,"2021-07-18",28,202128]
[null,null,"2021-07-19",29,202129]
[null,null,"2021-07-20",29,202129]
[null,null,"2021-07-21",29,202129]
[null,null,"2021-07-22",29,202129]
[null,null,"2021-07-23",29,202129]
[null,null,"2021-07-24",29,202129]
[null,null,"2021-07-25",29,202129]
[null,null,"2021-07-26",30,202130]
[null,null,"2021-07-27",30,202130]
[null,null,"2021-07-28",30,202130]
[null,null,"2021-07-29",30,202130]
[null,null,"2021-07-30",30,202130]
[null,null,"2021-07-31",30,202130]
[null,null,"2021-08-01",30,202130]
[null,null,"2021-08-02",31,202131]
[null,null,"2021-08-03",31,202131]
[null,null,"2021-08-04",31,202131]
[null,null,"2021-08-05",31,202131]
[null,null,"2021-08-06",31,202131]
[null,null,"2021-08-07",31,202131]
[null,null,"2021-08-08",31,202131]
[null,null,"2021-08-09",32,202132]
[null,null,"2021-08-10",32,202132]
[null,null,"2021-08-11",32,202132]
[null,null,"2021-08-12",32,202132]
[null,null,"2021-08-13",32,202132]
[null,null,"2021-08-14",32,202132]
[null,null,"2021-08-15",32,202132]
[null,null,"2021-08-16",33,202133]
[null,null,"2021-08-17",33,202133]
[null,null,"2021-08-18",33,202133]
[null,null,"2021-08-19",33,202133]
[null,null,"2021-08-20",33,202133]
[null,null,"2021-08-21",33,202133]
[null,null,"2021-08-22",33,202133]
[null,null,"2021-08-23",34,202134]
[null,null,"2021-08-24",34,202134]
[null,null,"2021-08-25",34,202134]
[null,null,"2021-08-26",34,202134]
[null,null,"2021-08-27",34,202134]
[null,null,"2021-08-28",34,202134]
[null,null,"2021-08-29",34,202134]
[null,null,"2021-08-30",35,202135]
[null,null,"2021-08-31",35,202135]
[null,null,"2021-09-01",35,202135]
[null,null,"2021-09-02",35,202135]
[null,null,"2021-09-03",35,202135]
[null,null,"2021-09-04",35,202135]
[null,null,"2021-09-05",35,202135]
[null,null,"2021-09-06",36,202136]
[null,null,"2021-09-07",36,202136]
[null,null,"2021-09-08",36,202136]
[null,null,"2021-09-09",36,202136]
[null,null,"2021-09-10",36,202136]
[null,null,"2021-09-11",36,202136]
[null,null,"2021-09-12",36,202136]
[null,null,"2021-09-13",37,202137]
[null,null,"2021-09-14",37,202137]
[null,null,"2021-09-15",37,202137]
[null,null,"2021-09-16",37,202137]
[null,null,"2021-09-17",37,202137]
[null,null,"2021-09-18",37,202137]
[null,null,"2021-09-19",37,202137]
[null,null,"2021-09-20",38,202138]
[null,null,"2021-09-21",38,202138]
[null,null,"2021-09-22",38,202138]
[null,null,"2021-09-23",38,202138]
[null,null,"2021-09-24",38,202138]
[null,null,"2021-09-25",38,202138]
[null,null,"2021-09-26",38,202138]
[null,null,"2021-09-27",39,202139]
[null,null,"2021-09-28",39,202139]
[null,null,"2021-09-29",39,202139]
[null,null,"2021-09-30",39,202139]
[null,null,"2021-10-01",39,202139]
[null,null,"2021-10-02",39,202139]
[null,null,"2021-10-03",39,202139]
[null,null,"2021-10-04",40,202140]
[null,null,"2021-10-05",40,202140]
[null,null,"2021-10-06",40,202140]
[null,null,"2021-10-07",40,202140]
[null,null,"2021-10-08",40,202140]
[null,null,"2021-10-09",40,202140]
[null,null,"2021-10-10",40,202140]
[null,null,"2021-10-11",41,202141]
[null,null,"2021-10-12",41,202141]
[null,null,"2021-10-13",41,202141]
[null,null,"2021-10-14",41,202141]
[null,null,"2021-10-15",41,202141]
[null,null,"2021-10-16",41,202141]
[null,null,"2021-10-17",41,202141]
[null,null,"2021-10-18",42,202142]
[null,null,"2021-10-19",42,202142]
[null,null,"2021-10-20",42,202142]
[null,null,"2021-10-21",42,202142]
[null,null,"2021-10-22",42,202142]
[null,null,"2021-10-23",42,202142]
[null,null,"2021-10-24",42,202142]
[null,null,"2021-10-25",43,202143]
[null,null,"2021-10-26",43,202143]
[null,null,"2021-10-27",43,202143]
[null,null,"2021-10-28",43,202143]
[null,null,"2021-10-29",43,202143]
[null,null,"2021-10-30",43,202143]
[null,null,"2021-10-31",43,202143]
[null,null,"2021-11-01",44,202144]
[null,null,"2021-11-02",44,202144]
[null,null,"2021-11-03",44,202144]
[null,null,"2021-11-04",44,202144]
[null,null,"2021-11-05",44,202144]
[null,null,"2021-11-06",44,202144]
[null,null,"2021-11-07",44,202144]
[null,null,"2021-11-08",45,202145]
[null,null,"2021-11-09",45,202145]
[null,null,"2021-11-10",45,202145]
[null,null,"2021-11-11",45,202145]
[null,null,"2021-11-12",45,202145]
[null,null,"2021-11-13",45,202145]
[null,null,"2021-11-14",45,202145]
[null,null,"2021-11-15",46,202146]
[null,null,"2021-11-16",46,202146]
[null,null,"2021-11-17",46,202146]
[null,null,"2021-11-18",46,202146]
[null,null,"2021-11-19",46,202146]
[null,null,"2021-11-20",46,202146]
[null,null,"2021-11-21",46,202146]
[null,null,"2021-11-22",47,202147]
[null,null,"2021-11-23",47,202147]
[null,null,"2021-11-24",47,202147]
[null,null,"2021-11-25",47,202147]
[null,null,"2021-11-26",47,202147]
[null,null,"2021-11-27",47,202147]
[null,null,"2021-11-28",47,202147]
[null,null,"2021-11-29",48,202148]
[null,null,"2021-11-30",48,202148]
[null,null,"2021-12-01",48,202148]
[null,null,"2021-12-02",48,202148]
[null,null,"2021-12-03",48,202148]
[null,null,"2021-12-04",48,202148]
[null,null,"2021-12-05",48,202148]
[null,null,"2021-12-06",49,202149]
[null,null,"2021-12-07",49,202149]
[null,null,"2021-12-08",49,202149]
[null,null,"2021-12-09",49,202149]
[null,null,"2021-12-10",49,202149]
[null,null,"2021-12-11",49,202149]
[null,null,"2021-12-12",49,202149]
[null,null,"2021-12-13",50,202150]
[null,null,"2021-12-14",50,202150]
[null,null,"2021-12-15",50,202150]
[null,null,"2021-12-16",50,202150]
[null,null,"2021-12-17",50,202150]
[null,null,"2021-12-18",50,202150]
[null,null,"2021-12-19",50,202150]
[null,null,"2021-12-20",51,202151]
[null,null,"2021-12-21",51,202151]
[null,null,"2021-12-22",51,202151]
[null,null,"2021-12-23",51,202151]
[null,null,"2021-12-24",51,202151]
[null,null,"2021-12-25",51,202151]
[null,null,"2021-12-26",51,202151]
[null,null,"2021-12-27",52,202152]
[null,null,"2021-12-28",52,202152]
[null,null,"2021-12-29",52,202152]
[null,null,"2021-12-30",52,202152]
[null,null,"2021-12-31",52,202152]
[null,null,"2022-01-01",1,202201]
[null,null,"2022-01-02",1,202201]
[null,null,"2022-01-03",1,202201]
[null,null,"2022-01-04",1,202201]
[null,null,"2022-01-05",1,202201]
[null,null,"2022-01-06",1,202201]
[null,null,"2022-01-07",1,202201]
[null,null,"2022-01-08",1,202201]
[null,null,"2022-01-09",1,202201]
[null,null,"2022-01-10",2,202202]
[null,null,"2022-01-11",2,202202]
[null,null,"2022-01-12",2,202202]
[null,null,"2022-01-13",2,202202]
[null,null,"2022-01-14",2,202202]
[null,null,"2022-01-15",2,202202]
[null,null,"2022-01-16",2,202202]
[null,null,"2022-01-17",3,202203]
[null,null,"2022-01-18",3,202203]
[null,null,"2022-01-19",3,202203]
[null,null,"2022-01-20",3,202203]
[null,null,"2022-01-21",3,202203]
[null,null,"2022-01-22",3,202203]
[null,null,"2022-01-23",3,202203]
[null,null,"2022-01-24",4,202204]
[null,null,"2022-01-25",4,202204]
[null,null,"2022-01-26",4,202204]
[null,null,"2022-01-27",4,202204]
[null,null,"2022-01-28",4,202204]
[null,null,"2022-01-29",4,202204]
[null,null,"2022-01-30",4,202204]
[null,null,"2022-01-31",5,202205]
[null,null,"2022-02-01",5,202205]
[null,null,"2022-02-02",5,202205]
[null,null,"2022-02-03",5,202205]
[null,null,"2022-02-04",5,202205]
[null,null,"2022-02-05",5,202205]
[null,null,"2022-02-06",5,202205]
[null,null,"2022-02-07",6,202206]
[null,null,"2022-02-08",6,202206]
[null,null,"2022-02-09",6,202206]
[null,null,"2022-02-10",6,202206]
[null,null,"2022-02-11",6,202206]
[null,null,"2022-02-12",6,202206]
[null,null,"2022-02-13",6,202206]
[null,null,"2022-02-14",7,202207]
[null,null,"2022-02-15",7,202207]
[null,null,"2022-02-16",7,202207]
[null,null,"2022-02-17",7,202207]
[null,null,"2022-02-18",7,202207]
[null,null,"2022-02-19",7,202207]
[null,null,"2022-02-20",7,202207]
[null,null,"2022-02-21",8,202208]
[null,null,"2022-02-22",8,202208]
[null,null,"2022-02-23",8,202208]
[null,null,"2022-02-24",8,202208]
[null,null,"2022-02-25",8,202208]
[null,null,"2022-02-26",8,202208]
[null,null,"2022-02-27",8,202208]
[null,null,"2022-02-28",9,202209]
[null,null,"2022-03-01",9,202209]
[null,null,"2022-03-02",9,202209]
[null,null,"2022-03-03",9,202209]
[null,null,"2022-03-04",9,202209]
[null,null,"2022-03-05",9,202209]
[null,null,"2022-03-06",9,202209]
[null,null,"2022-03-07",10,202210]
[null,null,"2022-03-08",10,202210]
[null,null,"2022-03-09",10,202210]
[null,null,"2022-03-10",10,202210]
[null,null,"2022-03-11",10,202210]
[null,null,"2022-03-12",10,202210]
[null,null,"2022-03-13",10,202210]
[null,null,"2022-03-14",11,202211]
[null,null,"2022-03-15",11,202211]
[null,null,"2022-03-16",11,202211]
[null,null,"2022-03-17",11,202211]
[null,null,"2022-03-18",11,202211]
[null,null,"2022-03-19",11,202211]
[null,null,"2022-03-20",11,202211]
[null,null,"2022-03-21",12,202212]
[null,null,"2022-03-22",12,202212]
[null,null,"2022-03-23",12,202212]
[null,null,"2022-03-24",12,202212]
[null,null,"2022-03-25",12,202212]
[null,null,"2022-03-26",12,202212]
[null,null,"2022-03-27",12,202212]
[null,null,"2022-03-28",13,202213]
[null,null,"2022-03-29",13,202213]
[null,null,"2022-03-30",13,202213]
[null,null,"2022-03-31",13,202213]
[null,null,"2022-04-01",13,202213]
[null,null,"2022-04-02",13,202213]
[null,null,"2022-04-03",13,202213]
[null,null,"2022-04-04",14,202214]
[null,null,"2022-04-05",14,202214]
[null,null,"2022-04-06",14,202214]
[null,null,"2022-04-07",14,202214]
[null,null,"2022-04-08",14,202214]
[null,null,"2022-04-09",14,202214]
[null,null,"2022-04-10",14,202214]
[null,null,"2022-04-11",15,202215]
[null,null,"2022-04-12",15,202215]
[null,null,"2022-04-13",15,202215]
[null,null,"2022-04-14",15,202215]
[null,null,"2022-04-15",15,202215]
[null,null,"2022-04-16",15,202215]
[null,null,"2022-04-17",15,202215]
[null,null,"2022-04-18",16,202216]
[null,null,"2022-04-19",16,202216]
[null,null,"2022-04-20",16,202216]
[null,null,"2022-04-21",16,202216]
[null,null,"2022-04-22",16,202216]
[null,null,"2022-04-23",16,202216]
[null,null,"2022-04-24",16,202216]
[null,null,"2022-04-25",17,202217]
[null,null,"2022-04-26",17,202217]
[null,null,"2022-04-27",17,202217]
[null,null,"2022-04-28",17,202217]
[null,null,"2022-04-29",17,202217]
[null,null,"2022-04-30",17,202217]
[null,null,"2022-05-01",17,202217]
[null,null,"2022-05-02",18,202218]
[null,null,"2022-05-03",18,202218]
[null,null,"2022-05-04",18,202218]
[null,null,"2022-05-05",18,202218]
[null,null,"2022-05-06",18,202218]
[null,null,"2022-05-07",18,202218]
[null,null,"2022-05-08",18,202218]
[null,null,"2022-05-09",19,202219]
[null,null,"2022-05-10",19,202219]
[null,null,"2022-05-11",19,202219]
[null,null,"2022-05-12",19,202219]
[null,null,"2022-05-13",19,202219]
[null,null,"2022-05-14",19,202219]
[null,null,"2022-05-15",19,202219]
[null,null,"2022-05-16",20,202220]
[null,null,"2022-05-17",20,202220]
[null,null,"2022-05-18",20,202220]
[null,null,"2022-05-19",20,202220]
[null,null,"2022-05-20",20,202220]
[null,null,"2022-05-21",20,202220]
[null,null,"2022-05-22",20,202220]
[null,null,"2022-05-23",21,202221]
[null,null,"2022-05-24",21,202221]
[null,null,"2022-05-25",21,202221]
[null,null,"2022-05-26",21,202221]
[null,null,"2022-05-27",21,202221]
[null,null,"2022-05-28",21,202221]
[null,null,"2022-05-29",21,202221]
[null,null,"2022-05-30",22,202222]
[null,null,"2022-05-31",22,202222]
[null,null,"2022-06-01",22,202222]
[null,null,"2022-06-02",22,202222]
[null,null,"2022-06-03",22,202222]
[null,null,"2022-06-04",22,202222]
[null,null,"2022-06-05",22,202222]
[null,null,"2022-06-06",23,202223]
[null,null,"2022-06-07",23,202223]
[null,null,"2022-06-08",23,202223]
[null,null,"2022-06-09",23,202223]
[null,null,"2022-06-10",23,202223]
[null,null,"2022-06-11",23,202223]
[null,null,"2022-06-12",23,202223]
[null,null,"2022-06-13",24,202224]
[null,null,"2022-06-14",24,202224]
[null,null,"2022-06-15",24,202224]
[null,null,"2022-06-16",24,202224]
[null,null,"2022-06-17",24,202224]
[null,null,"2022-06-18",24,202224]
[null,null,"2022-06-19",24,202224]
[null,null,"2022-06-20",25,202225]
[null,null,"2022-06-21",25,202225]
[null,null,"2022-06-22",25,202225]
[null,null,"2022-06-23",25,202225]
[null,null,"2022-06-24",25,202225]
[null,null,"2022-06-25",25,202225]
[null,null,"2022-06-26",25,202225]
[null,null,"2022-06-27",26,202226]
[null,null,"2022-06-28",26,202226]
[null,null,"2022-06-29",26,202226]
[null,null,"2022-06-30",26,202226]
[null,null,"2022-07-01",26,202226]
[null,null,"2022-07-02",26,202226]
[null,null,"2022-07-03",26,202226]
[null,null,"2022-07-04",27,202227]
[null,null,"2022-07-05",27,202227]
[null,null,"2022-07-06",27,202227]
[null,null,"2022-07-07",27,202227]
[null,null,"2022-07-08",27,202227]
[null,null,"2022-07-09",27,202227]
[null,null,"2022-07-10",27,202227]
[null,null,"2022-07-11",28,202228]
[null,null,"2022-07-12",28,202228]
[null,null,"2022-07-13",28,202228]
[null,null,"2022-07-14",28,202228]
[null,null,"2022-07-15",28,202228]
[null,null,"2022-07-16",28,202228]
[null,null,"2022-07-17",28,202228]
[null,null,"2022-07-18",29,202229]
[null,null,"2022-07-19",29,202229]
[null,null,"2022-07-20",29,202229]
[null,null,"2022-07-21",29,202229]
[null,null,"2022-07-22",29,202229]
[null,null,"2022-07-23",29,202229]
[null,null,"2022-07-24",29,202229]
[null,null,"2022-07-25",30,202230]
[null,null,"2022-07-26",30,202230]
[null,null,"2022-07-27",30,202230]
[null,null,"2022-07-28",30,202230]
[null,null,"2022-07-29",30,202230]
[null,null,"2022-07-30",30,202230]
[null,null,"2022-07-31",30,202230]
[null,null,"2022-08-01",31,202231]
[null,null,"2022-08-02",31,202231]
[null,null,"2022-08-03",31,202231]
[null,null,"2022-08-04",31,202231]
[null,null,"2022-08-05",31,202231]
[null,null,"2022-08-06",31,202231]
[null,null,"2022-08-07",31,202231]
[null,null,"2022-08-08",32,202232]
[null,null,"2022-08-09",32,202232]
[null,null,"2022-08-10",32,202232]
[null,null,"2022-08-11",32,202232]
[null,null,"2022-08-12",32,202232]
[null,null,"2022-08-13",32,202232]
[null,null,"2022-08-14",32,202232]
[null,null,"2022-08-15",33,202233]
[null,null,"2022-08-16",33,202233]
[null,null,"2022-08-17",33,202233]
[null,null,"2022-08-18",33,202233]
[null,null,"2022-08-19",33,202233]
[null,null,"2022-08-20",33,202233]
[null,null,"2022-08-21",33,202233]
[null,null,"2022-08-22",34,202234]
[null,null,"2022-08-23",34,202234]
[null,null,"2022-08-24",34,202234]
[null,null,"2022-08-25",34,202234]
[null,null,"2022-08-26",34,202234]
[null,null,"2022-08-27",34,202234]
[null,null,"2022-08-28",34,202234]
[null,null,"2022-08-29",35,202235]
[null,null,"2022-08-30",35,202235]
[null,null,"2022-08-31",35,202235]
[null,null,"2022-09-01",35,202235]
[null,null,"2022-09-02",35,202235]
[null,null,"2022-09-03",35,202235]
[null,null,"2022-09-04",35,202235]
[null,null,"2022-09-05",36,202236]
[null,null,"2022-09-06",36,202236]
[null,null,"2022-09-07",36,202236]
[null,null,"2022-09-08",36,202236]
[null,null,"2022-09-09",36,202236]
[null,null,"2022-09-10",36,202236]
[null,null,"2022-09-11",36,202236]
[null,null,"2022-09-12",37,202237]
[null,null,"2022-09-13",37,202237]
[null,null,"2022-09-14",37,202237]
[null,null,"2022-09-15",37,202237]
[null,null,"2022-09-16",37,202237]
[null,null,"2022-09-17",37,202237]
[null,null,"2022-09-18",37,202237]
[null,null,"2022-09-19",38,202238]
[null,null,"2022-09-20",38,202238]
[null,null,"2022-09-21",38,202238]
[null,null,"2022-09-22",38,202238]
[null,null,"2022-09-23",38,202238]
[null,null,"2022-09-24",38,202238]
[null,null,"2022-09-25",38,202238]
[null,null,"2022-09-26",39,202239]
[null,null,"2022-09-27",39,202239]
[null,null,"2022-09-28",39,202239]
[null,null,"2022-09-29",39,202239]
[null,null,"2022-09-30",39,202239]
[null,null,"2022-10-01",39,202239]
[null,null,"2022-10-02",39,202239]
[null,null,"2022-10-03",40,202240]
[null,null,"2022-10-04",40,202240]
[null,null,"2022-10-05",40,202240]
[null,null,"2022-10-06",40,202240]
[null,null,"2022-10-07",40,202240]
[null,null,"2022-10-08",40,202240]
[null,null,"2022-10-09",40,202240]
[null,null,"2022-10-10",41,202241]
[null,null,"2022-10-11",41,202241]
[null,null,"2022-10-12",41,202241]
[null,null,"2022-10-13",41,202241]
[null,null,"2022-10-14",41,202241]
[null,null,"2022-10-15",41,202241]
[null,null,"2022-10-16",41,202241]
[null,null,"2022-10-17",42,202242]
[null,null,"2022-10-18",42,202242]
[null,null,"2022-10-19",42,202242]
[null,null,"2022-10-20",42,202242]
[null,null,"2022-10-21",42,202242]
[null,null,"2022-10-22",42,202242]
[null,null,"2022-10-23",42,202242]
[null,null,"2022-10-24",43,202243]
[null,null,"2022-10-25",43,202243]
[null,null,"2022-10-26",43,202243]
[null,null,"2022-10-27",43,202243]
[null,null,"2022-10-28",43,202243]
[null,null,"2022-10-29",43,202243]
[null,null,"2022-10-30",43,202243]
[null,null,"2022-10-31",44,202244]
[null,null,"2022-11-01",44,202244]
[null,null,"2022-11-02",44,202244]
[null,null,"2022-11-03",44,202244]
[null,null,"2022-11-04",44,202244]
[null,null,"2022-11-05",44,202244]
[null,null,"2022-11-06",44,202244]
[null,null,"2022-11-07",45,202245]
[null,null,"2022-11-08",45,202245]
[null,null,"2022-11-09",45,202245]
[null,null,"2022-11-10",45,202245]
[null,null,"2022-11-11",45,202245]
[null,null,"2022-11-12",45,202245]
[null,null,"2022-11-13",45,202245]
[null,null,"2022-11-14",46,202246]
[null,null,"2022-11-15",46,202246]
[null,null,"2022-11-16",46,202246]
[null,null,"2022-11-17",46,202246]
[null,null,"2022-11-18",46,202246]
[null,null,"2022-11-19",46,202246]
[null,null,"2022-11-20",46,202246]
[null,null,"2022-11-21",47,202247]
[null,null,"2022-11-22",47,202247]
[null,null,"2022-11-23",47,202247]
[null,null,"2022-11-24",47,202247]
[null,null,"2022-11-25",47,202247]
[null,null,"2022-11-26",47,202247]
[null,null,"2022-11-27",47,202247]
[null,null,"2022-11-28",48,202248]
[null,null,"2022-11-29",48,202248]
[null,null,"2022-11-30",48,202248]
[null,null,"2022-12-01",48,202248]
[null,null,"2022-12-02",48,202248]
[null,null,"2022-12-03",48,202248]
[null,null,"2022-12-04",48,202248]
[null,null,"2022-12-05",49,202249]
[null,null,"2022-12-06",49,202249]
[null,null,"2022-12-07",49,202249]
[null,null,"2022-12-08",49,202249]
[null,null,"2022-12-09",49,202249]
[null,null,"2022-12-10",49,202249]
[null,null,"2022-12-11",49,202249]
[null,null,"2022-12-12",50,202250]
[null,null,"2022-12-13",50,202250]
[null,null,"2022-12-14",50,202250]
[null,null,"2022-12-15",50,202250]
[null,null,"2022-12-16",50,202250]
[null,null,"2022-12-17",50,202250]
[null,null,"2022-12-18",50,202250]
[null,null,"2022-12-19",51,202251]
[null,null,"2022-12-20",51,202251]
[null,null,"2022-12-21",51,202251]
[null,null,"2022-12-22",51,202251]
[null,null,"2022-12-23",51,202251]
[null,null,"2022-12-24",51,202251]
[null,null,"2022-12-25",51,202251]
[null,null,"2022-12-26",52,202252]
[null,null,"2022-12-27",52,202252]
[null,null,"2022-12-28",52,202252]
[null,null,"2022-12-29",52,202252]
[null,null,"2022-12-30",52,202252]
[null,null,"2022-12-31",52,202252]
[null,null,"2023-01-01",1,202301]
[null,null,"2023-01-02",1,202301]
[null,null,"2023-01-03",1,202301]
[null,null,"2023-01-04",1,202301]
[null,null,"2023-01-05",1,202301]
[null,null,"2023-01-06",1,202301]
[null,null,"2023-01-07",1,202301]
[null,null,"2023-01-08",1,202301]
[null,null,"2023-01-09",2,202302]
[null,null,"2023-01-10",2,202302]
[null,null,"2023-01-11",2,202302]
[null,null,"2023-01-12",2,202302]
[null,null,"2023-01-13",2,202302]
[null,null,"2023-01-14",2,202302]
[null,null,"2023-01-15",2,202302]
[null,null,"2023-01-16",3,202303]
[null,null,"2023-01-17",3,202303]
[null,null,"2023-01-18",3,202303]
[null,null,"2023-01-19",3,202303]
[null,null,"2023-01-20",3,202303]
[null,null,"2023-01-21",3,202303]
[null,null,"2023-01-22",3,202303]
[null,null,"2023-01-23",4,202304]
[null,null,"2023-01-24",4,202304]
[null,null,"2023-01-25",4,202304]
[null,null,"2023-01-26",4,202304]
[null,null,"2023-01-27",4,202304]
[null,null,"2023-01-28",4,202304]
[null,null,"2023-01-29",4,202304]
[null,null,"2023-01-30",5,202305]
[null,null,"2023-01-31",5,202305]
[null,null,"2023-02-01",5,202305]
[null,null,"2023-02-02",5,202305]
[null,null,"2023-02-03",5,202305]
[null,null,"2023-02-04",5,202305]
[null,null,"2023-02-05",5,202305]
[null,null,"2023-02-06",6,202306]
[null,null,"2023-02-07",6,202306]
[null,null,"2023-02-08",6,202306]
[null,null,"2023-02-09",6,202306]
[null,null,"2023-02-10",6,202306]
[null,null,"2023-02-11",6,202306]
[null,null,"2023-02-12",6,202306]
[null,null,"2023-02-13",7,202307]
[null,null,"2023-02-14",7,202307]
[null,null,"2023-02-15",7,202307]
[null,null,"2023-02-16",7,202307]
[null,null,"2023-02-17",7,202307]
[null,null,"2023-02-18",7,202307]
[null,null,"2023-02-19",7,202307]
[null,null,"2023-02-20",8,202308]
[null,null,"2023-02-21",8,202308]
[null,null,"2023-02-22",8,202308]
[null,null,"2023-02-23",8,202308]
[null,null,"2023-02-24",8,202308]
[null,null,"2023-02-25",8,202308]
[null,null,"2023-02-26",8,202308]
[null,null,"2023-02-27",9,202309]
[null,null,"2023-02-28",9,202309]
[null,null,"2023-03-01",9,202309]
[null,null,"2023-03-02",9,202309]
[null,null,"2023-03-03",9,202309]
[null,null,"2023-03-04",9,202309]
[null,null,"2023-03-05",9,202309]
[null,null,"2023-03-06",10,202310]
[null,null,"2023-03-07",10,202310]
[null,null,"2023-03-08",10,202310]
[null,null,"2023-03-09",10,202310]
[null,null,"2023-03-10",10,202310]
[null,null,"2023-03-11",10,202310]
[null,null,"2023-03-12",10,202310]
[null,null,"2023-03-13",11,202311]
[null,null,"2023-03-14",11,202311]
[null,null,"2023-03-15",11,202311]
[null,null,"2023-03-16",11,202311]
[null,null,"2023-03-17",11,202311]
[null,null,"2023-03-18",11,202311]
[null,null,"2023-03-19",11,202311]
[null,null,"2023-03-20",12,202312]
[null,null,"2023-03-21",12,202312]
[null,null,"2023-03-22",12,202312]
[null,null,"2023-03-23",12,202312]
[null,null,"2023-03-24",12,202312]
[null,null,"2023-03-25",12,202312]
[null,null,"2023-03-26",12,202312]
[null,null,"2023-03-27",13,202313]
[null,null,"2023-03-28",13,202313]
[null,null,"2023-03-29",13,202313]
[null,null,"2023-03-30",13,202313]
[null,null,"2023-03-31",13,202313]
[null,null,"2023-04-01",13,202313]
[null,null,"2023-04-02",13,202313]
[null,null,"2023-04-03",14,202314]
[null,null,"2023-04-04",14,202314]
[null,null,"2023-04-05",14,202314]
[null,null,"2023-04-06",14,202314]
[null,null,"2023-04-07",14,202314]
[null,null,"2023-04-08",14,202314]
[null,null,"2023-04-09",14,202314]
[null,null,"2023-04-10",15,202315]
[null,null,"2023-04-11",15,202315]
[null,null,"2023-04-12",15,202315]
[null,null,"2023-04-13",15,202315]
[null,null,"2023-04-14",15,202315]
[null,null,"2023-04-15",15,202315]
[null,null,"2023-04-16",15,202315]
[null,null,"2023-04-17",16,202316]
[null,null,"2023-04-18",16,202316]
[null,null,"2023-04-19",16,202316]
[null,null,"2023-04-20",16,202316]
[null,null,"2023-04-21",16,202316]
[null,null,"2023-04-22",16,202316]
[null,null,"2023-04-23",16,202316]
[null,null,"2023-04-24",17,202317]
[null,null,"2023-04-25",17,202317]
[null,null,"2023-04-26",17,202317]
[null,null,"2023-04-27",17,202317]
[null,null,"2023-04-28",17,202317]
[null,null,"2023-04-29",17,202317]
[null,null,"2023-04-30",17,202317]
[null,null,"2023-05-01",18,202318]
[null,null,"2023-05-02",18,202318]
[null,null,"2023-05-03",18,202318]
[null,null,"2023-05-04",18,202318]
[null,null,"2023-05-05",18,202318]
[null,null,"2023-05-06",18,202318]
[null,null,"2023-05-07",18,202318]
[null,null,"2023-05-08",19,202319]
[null,null,"2023-05-09",19,202319]
[null,null,"2023-05-10",19,202319]
[null,null,"2023-05-11",19,202319]
[null,null,"2023-05-12",19,202319]
[null,null,"2023-05-13",19,202319]
[null,null,"2023-05-14",19,202319]
[null,null,"2023-05-15",20,202320]
[null,null,"2023-05-16",20,202320]
[null,null,"2023-05-17",20,202320]
[null,null,"2023-05-18",20,202320]
[null,null,"2023-05-19",20,202320]
[null,null,"2023-05-20",20,202320]
[null,null,"2023-05-21",20,202320]
[null,null,"2023-05-22",21,202321]
[null,null,"2023-05-23",21,202321]
[null,null,"2023-05-24",21,202321]
[null,null,"2023-05-25",21,202321]
[null,null,"2023-05-26",21,202321]
[null,null,"2023-05-27",21,202321]
[null,null,"2023-05-28",21,202321]
[null,null,"2023-05-29",22,202322]
[null,null,"2023-05-30",22,202322]
[null,null,"2023-05-31",22,202322]
[null,null,"2023-06-01",22,202322]
[null,null,"2023-06-02",22,202322]
[null,null,"2023-06-03",22,202322]
[null,null,"2023-06-04",22,202322]
[null,null,"2023-06-05",23,202323]
[null,null,"2023-06-06",23,202323]
[null,null,"2023-06-07",23,202323]
[null,null,"2023-06-08",23,202323]
[null,null,"2023-06-09",23,202323]
[null,null,"2023-06-10",23,202323]
[null,null,"2023-06-11",23,202323]
[null,null,"2023-06-12",24,202324]
[null,null,"2023-06-13",24,202324]
[null,null,"2023-06-14",24,202324]
[null,null,"2023-06-15",24,202324]
[null,null,"2023-06-16",24,202324]
[null,null,"2023-06-17",24,202324]
[null,null,"2023-06-18",24,202324]
[null,null,"2023-06-19",25,202325]
[null,null,"2023-06-20",25,202325]
[null,null,"2023-06-21",25,202325]
[null,null,"2023-06-22",25,202325]
[null,null,"2023-06-23",25,202325]
[null,null,"2023-06-24",25,202325]
[null,null,"2023-06-25",25,202325]
[null,null,"2023-06-26",26,202326]
[null,null,"2023-06-27",26,202326]
[null,null,"2023-06-28",26,202326]
[null,null,"2023-06-29",26,202326]
[null,null,"2023-06-30",26,202326]
[null,null,"2023-07-01",26,202326]
[null,null,"2023-07-02",26,202326]
[null,null,"2023-07-03",27,202327]
[null,null,"2023-07-04",27,202327]
[null,null,"2023-07-05",27,202327]
[null,null,"2023-07-06",27,202327]
[null,null,"2023-07-07",27,202327]
[null,null,"2023-07-08",27,202327]
[null,null,"2023-07-09",27,202327]
[null,null,"2023-07-10",28,202328]
[null,null,"2023-07-11",28,202328]
[null,null,"2023-07-12",28,202328]
[null,null,"2023-07-13",28,202328]
[null,null,"2023-07-14",28,202328]
[null,null,"2023-07-15",28,202328]
[null,null,"2023-07-16",28,202328]
[null,null,"2023-07-17",29,202329]
[null,null,"2023-07-18",29,202329]
[null,null,"2023-07-19",29,202329]
[null,null,"2023-07-20",29,202329]
[null,null,"2023-07-21",29,202329]
[null,null,"2023-07-22",29,202329]
[null,null,"2023-07-23",29,202329]
[null,null,"2023-07-24",30,202330]
[null,null,"2023-07-25",30,202330]
[null,null,"2023-07-26",30,202330]
[null,null,"2023-07-27",30,202330]
[null,null,"2023-07-28",30,202330]
[null,null,"2023-07-29",30,202330]
[null,null,"2023-07-30",30,202330]
[null,null,"2023-07-31",31,202331]
[null,null,"2023-08-01",31,202331]
[null,null,"2023-08-02",31,202331]
[null,null,"2023-08-03",31,202331]
[null,null,"2023-08-04",31,202331]
[null,null,"2023-08-05",31,202331]
[null,null,"2023-08-06",31,202331]
[null,null,"2023-08-07",32,202332]
[null,null,"2023-08-08",32,202332]
[null,null,"2023-08-09",32,202332]
[null,null,"2023-08-10",32,202332]
[null,null,"2023-08-11",32,202332]
[null,null,"2023-08-12",32,202332]
[null,null,"2023-08-13",32,202332]
[null,null,"2023-08-14",33,202333]
[null,null,"2023-08-15",33,202333]
[null,null,"2023-08-16",33,202333]
[null,null,"2023-08-17",33,202333]
[null,null,"2023-08-18",33,202333]
[null,null,"2023-08-19",33,202333]
[null,null,"2023-08-20",33,202333]
[null,null,"2023-08-21",34,202334]
[null,null,"2023-08-22",34,202334]
[null,null,"2023-08-23",34,202334]
[null,null,"2023-08-24",34,202334]
[null,null,"2023-08-25",34,202334]
[null,null,"2023-08-26",34,202334]
[null,null,"2023-08-27",34,202334]
[null,null,"2023-08-28",35,202335]
[null,null,"2023-08-29",35,202335]
[null,null,"2023-08-30",35,202335]
[null,null,"2023-08-31",35,202335]
[null,null,"2023-09-01",35,202335]
[null,null,"2023-09-02",35,202335]
[null,null,"2023-09-03",35,202335]
[null,null,"2023-09-04",36,202336]
[null,null,"2023-09-05",36,202336]
[null,null,"2023-09-06",36,202336]
[null,null,"2023-09-07",36,202336]
[null,null,"2023-09-08",36,202336]
[null,null,"2023-09-09",36,202336]
[null,null,"2023-09-10",36,202336]
[null,null,"2023-09-11",37,202337]
[null,null,"2023-09-12",37,202337]
[null,null,"2023-09-13",37,202337]
[null,null,"2023-09-14",37,202337]
[null,null,"2023-09-15",37,202337]
[null,null,"2023-09-16",37,202337]
[null,null,"2023-09-17",37,202337]
[null,null,"2023-09-18",38,202338]
[null,null,"2023-09-19",38,202338]
[null,null,"2023-09-20",38,202338]
[null,null,"2023-09-21",38,202338]
[null,null,"2023-09-22",38,202338]
[null,null,"2023-09-23",38,202338]
[null,null,"2023-09-24",38,202338]
[null,null,"2023-09-25",39,202339]
[null,null,"2023-09-26",39,202339]
[null,null,"2023-09-27",39,202339]
[null,null,"2023-09-28",39,202339]
[null,null,"2023-09-29",39,202339]
[null,null,"2023-09-30",39,202339]
[null,null,"2023-10-01",39,202339]
[null,null,"2023-10-02",40,202340]
[null,null,"2023-10-03",40,202340]
[null,null,"2023-10-04",40,202340]
[null,null,"2023-10-05",40,202340]
[null,null,"2023-10-06",40,202340]
[null,null,"2023-10-07",40,202340]
[null,null,"2023-10-08",40,202340]
[null,null,"2023-10-09",41,202341]
[null,null,"2023-10-10",41,202341]
[null,null,"2023-10-11",41,202341]
[null,null,"2023-10-12",41,202341]
[null,null,"2023-10-13",41,202341]
[null,null,"2023-10-14",41,202341]
[null,null,"2023-10-15",41,202341]
[null,null,"2023-10-16",42,202342]
[null,null,"2023-10-17",42,202342]
[null,null,"2023-10-18",42,202342]
[null,null,"2023-10-19",42,202342]
[null,null,"2023-10-20",42,202342]
[null,null,"2023-10-21",42,202342]
[null,null,"2023-10-22",42,202342]
[null,null,"2023-10-23",43,202343]
[null,null,"2023-10-24",43,202343]
[null,null,"2023-10-25",43,202343]
[null,null,"2023-10-26",43,202343]
[null,null,"2023-10-27",43,202343]
[null,null,"2023-10-28",43,202343]
[null,null,"2023-10-29",43,202343]
[null,null,"2023-10-30",44,202344]
[null,null,"2023-10-31",44,202344]
[null,null,"2023-11-01",44,202344]
[null,null,"2023-11-02",44,202344]
[null,null,"2023-11-03",44,202344]
[null,null,"2023-11-04",44,202344]
[null,null,"2023-11-05",44,202344]
[null,null,"2023-11-06",45,202345]
[null,null,"2023-11-07",45,202345]
[null,null,"2023-11-08",45,202345]
[null,null,"2023-11-09",45,202345]
[null,null,"2023-11-10",45,202345]
[null,null,"2023-11-11",45,202345]
[null,null,"2023-11-12",45,202345]
[null,null,"2023-11-13",46,202346]
[null,null,"2023-11-14",46,202346]
[null,null,"2023-11-15",46,202346]
[null,null,"2023-11-16",46,202346]
[null,null,"2023-11-17",46,202346]
[null,null,"2023-11-18",46,202346]
[null,null,"2023-11-19",46,202346]
[null,null,"2023-11-20",47,202347]
[null,null,"2023-11-21",47,202347]
[null,null,"2023-11-22",47,202347]
[null,null,"2023-11-23",47,202347]
[null,null,"2023-11-24",47,202347]
[null,null,"2023-11-25",47,202347]
[null,null,"2023-11-26",47,202347]
[null,null,"2023-11-27",48,202348]
[null,null,"2023-11-28",48,202348]
[null,null,"2023-11-29",48,202348]
[null,null,"2023-11-30",48,202348]
[null,null,"2023-12-01",48,202348]
[null,null,"2023-12-02",48,202348]
[null,null,"2023-12-03",48,202348]
[null,null,"2023-12-04",49,202349]
[null,null,"2023-12-05",49,202349]
[null,null,"2023-12-06",49,202349]
[null,null,"2023-12-07",49,202349]
[null,null,"2023-12-08",49,202349]
[null,null,"2023-12-09",49,202349]
[null,null,"2023-12-10",49,202349]
[null,null,"2023-12-11",50,202350]
[null,null,"2023-12-12",50,202350]
[null,null,"2023-12-13",50,202350]
[null,null,"2023-12-14",50,202350]
[null,null,"2023-12-15",50,202350]
[null,null,"2023-12-16",50,202350]
[null,null,"2023-12-17",50,202350]
[null,null,"2023-12-18",51,202351]
[null,null,"2023-12-19",51,202351]
[null,null,"2023-12-20",51,202351]
[null,null,"2023-12-21",51,202351]
[null,null,"2023-12-22",51,202351]
[null,null,"2023-12-23",51,202351]
[null,null,"2023-12-24",51,202351]
[null,null,"2023-12-25",52,202352]
[null,null,"2023-12-26",52,202352]
[null,null,"2023-12-27",52,202352]
[null,null,"2023-12-28",52,202352]
[null,null,"2023-12-29",52,202352]
[null,null,"2023-12-30",52,202352]
[null,null,"2023-12-31",52,202352]
[null,null,"2024-01-01",1,202401]
[null,null,"2024-01-02",1,202401]
[null,null,"2024-01-03",1,202401]
[null,null,"2024-01-04",1,202401]
[null,null,"2024-01-05",1,202401]
[null,null,"2024-01-06",1,202401]
[null,null,"2024-01-07",1,202401]
[null,null,"2024-01-08",2,202402]
[null,null,"2024-01-09",2,202402]
[null,null,"2024-01-10",2,202402]
[null,null,"2024-01-11",2,202402]
[null,null,"2024-01-12",2,202402]
[null,null,"2024-01-13",2,202402]
[null,null,"2024-01-14",2,202402]
[null,null,"2024-01-15",3,202403]
[null,null,"2024-01-16",3,202403]
[null,null,"2024-01-17",3,202403]
[null,null,"2024-01-18",3,202403]
[null,null,"2024-01-19",3,202403]
[null,null,"2024-01-20",3,202403]
[null,null,"2024-01-21",3,202403]
[null,null,"2024-01-22",4,202404]
[null,null,"2024-01-23",4,202404]
[null,null,"2024-01-24",4,202404]
[null,null,"2024-01-25",4,202404]
[null,null,"2024-01-26",4,202404]
[null,null,"2024-01-27",4,202404]
[null,null,"2024-01-28",4,202404]
[null,null,"2024-01-29",5,202405]
[null,null,"2024-01-30",5,202405]
[null,null,"2024-01-31",5,202405]
[null,null,"2024-02-01",5,202405]
[null,null,"2024-02-02",5,202405]
[null,null,"2024-02-03",5,202405]
[null,null,"2024-02-04",5,202405]
[null,null,"2024-02-05",6,202406]
[null,null,"2024-02-06",6,202406]
[null,null,"2024-02-07",6,202406]
[null,null,"2024-02-08",6,202406]
[null,null,"2024-02-09",6,202406]
[null,null,"2024-02-10",6,202406]
[null,null,"2024-02-11",6,202406]
[null,null,"2024-02-12",7,202407]
[null,null,"2024-02-13",7,202407]
[null,null,"2024-02-14",7,202407]
[null,null,"2024-02-15",7,202407]
[null,null,"2024-02-16",7,202407]
[null,null,"2024-02-17",7,202407]
[null,null,"2024-02-18",7,202407]
[null,null,"2024-02-19",8,202408]
[null,null,"2024-02-20",8,202408]
[null,null,"2024-02-21",8,202408]
[null,null,"2024-02-22",8,202408]
[null,null,"2024-02-23",8,202408]
[null,null,"2024-02-24",8,202408]
[null,null,"2024-02-25",8,202408]
[null,null,"2024-02-26",9,202409]
[null,null,"2024-02-27",9,202409]
[null,null,"2024-02-28",9,202409]
[null,null,"2024-02-29",9,202409]
[null,null,"2024-03-01",9,202409]
[null,null,"2024-03-02",9,202409]
[null,null,"2024-03-03",9,202409]
[null,null,"2024-03-04",10,202410]
[null,null,"2024-03-05",10,202410]
[null,null,"2024-03-06",10,202410]
[null,null,"2024-03-07",10,202410]
[null,null,"2024-03-08",10,202410]
[null,null,"2024-03-09",10,202410]
[null,null,"2024-03-10",10,202410]
[null,null,"2024-03-11",11,202411]
[null,null,"2024-03-12",11,202411]
[null,null,"2024-03-13",11,202411]
[null,null,"2024-03-14",11,202411]
[null,null,"2024-03-15",11,202411]
[null,null,"2024-03-16",11,202411]
[null,null,"2024-03-17",11,202411]
[null,null,"2024-03-18",12,202412]
[null,null,"2024-03-19",12,202412]
[null,null,"2024-03-20",12,202412]
[null,null,"2024-03-21",12,202412]
[null,null,"2024-03-22",12,202412]
[null,null,"2024-03-23",12,202412]
[null,null,"2024-03-24",12,202412]
[null,null,"2024-03-25",13,202413]
[null,null,"2024-03-26",13,202413]
[null,null,"2024-03-27",13,202413]
[null,null,"2024-03-28",13,202413]
[null,null,"2024-03-29",13,202413]
[null,null,"2024-03-30",13,202413]
[null,null,"2024-03-31",13,202413]
[null,null,"2024-04-01",14,202414]
[null,null,"2024-04-02",14,202414]
[null,null,"2024-04-03",14,202414]
[null,null,"2024-04-04",14,202414]
[null,null,"2024-04-05",14,202414]
[null,null,"2024-04-06",14,202414]
[null,null,"2024-04-07",14,202414]
[null,null,"2024-04-08",15,202415]
[null,null,"2024-04-09",15,202415]
[null,null,"2024-04-10",15,202415]
[null,null,"2024-04-11",15,202415]
[null,null,"2024-04-12",15,202415]
[null,null,"2024-04-13",15,202415]
[null,null,"2024-04-14",15,202415]
[null,null,"2024-04-15",16,202416]
[null,null,"2024-04-16",16,202416]
[null,null,"2024-04-17",16,202416]
[null,null,"2024-04-18",16,202416]
[null,null,"2024-04-19",16,202416]
[null,null,"2024-04-20",16,202416]
[null,null,"2024-04-21",16,202416]
[null,null,"2024-04-22",17,202417]
[null,null,"2024-04-23",17,202417]
[null,null,"2024-04-24",17,202417]
[null,null,"2024-04-25",17,202417]
[null,null,"2024-04-26",17,202417]
[null,null,"2024-04-27",17,202417]
[null,null,"2024-04-28",17,202417]
[null,null,"2024-04-29",18,202418]
[null,null,"2024-04-30",18,202418]
[null,null,"2024-05-01",18,202418]
[null,null,"2024-05-02",18,202418]
[null,null,"2024-05-03",18,202418]
[null,null,"2024-05-04",18,202418]
[null,null,"2024-05-05",18,202418]
[null,null,"2024-05-06",19,202419]
[null,null,"2024-05-07",19,202419]
[null,null,"2024-05-08",19,202419]
[null,null,"2024-05-09",19,202419]
[null,null,"2024-05-10",19,202419]
[null,null,"2024-05-11",19,202419]
[null,null,"2024-05-12",19,202419]
[null,null,"2024-05-13",20,202420]
[null,null,"2024-05-14",20,202420]
[null,null,"2024-05-15",20,202420]
[null,null,"2024-05-16",20,202420]
[null,null,"2024-05-17",20,202420]
[null,null,"2024-05-18",20,202420]
[null,null,"2024-05-19",20,202420]
[null,null,"2024-05-20",21,202421]
[null,null,"2024-05-21",21,202421]
[null,null,"2024-05-22",21,202421]
[null,null,"2024-05-23",21,202421]
[null,null,"2024-05-24",21,202421]
[null,null,"2024-05-25",21,202421]
[null,null,"2024-05-26",21,202421]
[null,null,"2024-05-27",22,202422]
[null,null,"2024-05-28",22,202422]
[null,null,"2024-05-29",22,202422]
[null,null,"2024-05-30",22,202422]
[null,null,"2024-05-31",22,202422]
[null,null,"2024-06-01",22,202422]
[null,null,"2024-06-02",22,202422]
[null,null,"2024-06-03",23,202423]
[null,null,"2024-06-04",23,202423]
[null,null,"2024-06-05",23,202423]
[null,null,"2024-06-06",23,202423]
[null,null,"2024-06-07",23,202423]
[null,null,"2024-06-08",23,202423]
[null,null,"2024-06-09",23,202423]
[null,null,"2024-06-10",24,202424]
[null,null,"2024-06-11",24,202424]
[null,null,"2024-06-12",24,202424]
[null,null,"2024-06-13",24,202424]
[null,null,"2024-06-14",24,202424]
[null,null,"2024-06-15",24,202424]
[null,null,"2024-06-16",24,202424]
[null,null,"2024-06-17",25,202425]
[null,null,"2024-06-18",25,202425]
[null,null,"2024-06-19",25,202425]
[null,null,"2024-06-20",25,202425]
[null,null,"2024-06-21",25,202425]
[null,null,"2024-06-22",25,202425]
[null,null,"2024-06-23",25,202425]
[null,null,"2024-06-24",26,202426]
[null,null,"2024-06-25",26,202426]
[null,null,"2024-06-26",26,202426]
[null,null,"2024-06-27",26,202426]
[null,null,"2024-06-28",26,202426]
[null,null,"2024-06-29",26,202426]
[null,null,"2024-06-30",26,202426]
[null,null,"2024-07-01",27,202427]
[null,null,"2024-07-02",27,202427]
[null,null,"2024-07-03",27,202427]
[null,null,"2024-07-04",27,202427]
[null,null,"2024-07-05",27,202427]
[null,null,"2024-07-06",27,202427]
[null,null,"2024-07-07",27,202427]
[null,null,"2024-07-08",28,202428]
[null,null,"2024-07-09",28,202428]
[null,null,"2024-07-10",28,202428]
[null,null,"2024-07-11",28,202428]
[null,null,"2024-07-12",28,202428]
[null,null,"2024-07-13",28,202428]
[null,null,"2024-07-14",28,202428]
[null,null,"2024-07-15",29,202429]
[null,null,"2024-07-16",29,202429]
[null,null,"2024-07-17",29,202429]
[null,null,"2024-07-18",29,202429]
[null,null,"2024-07-19",29,202429]
[null,null,"2024-07-20",29,202429]
[null,null,"2024-07-21",29,202429]
[null,null,"2024-07-22",30,202430]
[null,null,"2024-07-23",30,202430]
[null,null,"2024-07-24",30,202430]
[null,null,"2024-07-25",30,202430]
[null,null,"2024-07-26",30,202430]
[null,null,"2024-07-27",30,202430]
[null,null,"2024-07-28",30,202430]
[null,null,"2024-07-29",31,202431]
[null,null,"2024-07-30",31,202431]
[null,null,"2024-07-31",31,202431]
[null,null,"2024-08-01",31,202431]
[null,null,"2024-08-02",31,202431]
[null,null,"2024-08-03",31,202431]
[null,null,"2024-08-04",31,202431]
[null,null,"2024-08-05",32,202432]
[null,null,"2024-08-06",32,202432]
[null,null,"2024-08-07",32,202432]
[null,null,"2024-08-08",32,202432]
[null,null,"2024-08-09",32,202432]
[null,null,"2024-08-10",32,202432]
[null,null,"2024-08-11",32,202432]
[null,null,"2024-08-12",33,202433]
[null,null,"2024-08-13",33,202433]
[null,null,"2024-08-14",33,202433]
[null,null,"2024-08-15",33,202433]
[null,null,"2024-08-16",33,202433]
[null,null,"2024-08-17",33,202433]
[null,null,"2024-08-18",33,202433]
[null,null,"2024-08-19",34,202434]
[null,null,"2024-08-20",34,202434]
[null,null,"2024-08-21",34,202434]
[null,null,"2024-08-22",34,202434]
[null,null,"2024-08-23",34,202434]
[null,null,"2024-08-24",34,202434]
[null,null,"2024-08-25",34,202434]
[null,null,"2024-08-26",35,202435]
[null,null,"2024-08-27",35,202435]
[null,null,"2024-08-28",35,202435]
[null,null,"2024-08-29",35,202435]
[null,null,"2024-08-30",35,202435]
[null,null,"2024-08-31",35,202435]
[null,null,"2024-09-01",35,202435]
[null,null,"2024-09-02",36,202436]
[null,null,"2024-09-03",36,202436]
[null,null,"2024-09-04",36,202436]
[null,null,"2024-09-05",36,202436]
[null,null,"2024-09-06",36,202436]
[null,null,"2024-09-07",36,202436]
[null,null,"2024-09-08",36,202436]
[null,null,"2024-09-09",37,202437]
[null,null,"2024-09-10",37,202437]
[null,null,"2024-09-11",37,202437]
[null,null,"2024-09-12",37,202437]
[null,null,"2024-09-13",37,202437]
[null,null,"2024-09-14",37,202437]
[null,null,"2024-09-15",37,202437]
[null,null,"2024-09-16",38,202438]
[null,null,"2024-09-17",38,202438]
[null,null,"2024-09-18",38,202438]
[null,null,"2024-09-19",38,202438]
[null,null,"2024-09-20",38,202438]
[null,null,"2024-09-21",38,202438]
[null,null,"2024-09-22",38,202438]
[null,null,"2024-09-23",39,202439]
[null,null,"2024-09-24",39,202439]
[null,null,"2024-09-25",39,202439]
[null,null,"2024-09-26",39,202439]
[null,null,"2024-09-27",39,202439]
[null,null,"2024-09-28",39,202439]
[null,null,"2024-09-29",39,202439]
[null,null,"2024-09-30",40,202440]
[null,null,"2024-10-01",40,202440]
[null,null,"2024-10-02",40,202440]
[null,null,"2024-10-03",40,202440]
[null,null,"2024-10-04",40,202440]
[null,null,"2024-10-05",40,202440]
[null,null,"2024-10-06",40,202440]
[null,null,"2024-10-07",41,202441]
[null,null,"2024-10-08",41,202441]
[null,null,"2024-10-09",41,202441]
[null,null,"2024-10-10",41,202441]
[null,null,"2024-10-11",41,202441]
[null,null,"2024-10-12",41,202441]
[null,null,"2024-10-13",41,202441]
[null,null,"2024-10-14",42,202442]
[null,null,"2024-10-15",42,202442]
[null,null,"2024-10-16",42,202442]
[null,null,"2024-10-17",42,202442]
[null,null,"2024-10-18",42,202442]
[null,null,"2024-10-19",42,202442]
[null,null,"2024-10-20",42,202442]
[null,null,"2024-10-21",43,202443]
[null,null,"2024-10-22",43,202443]
[null,null,"2024-10-23",43,202443]
[null,null,"2024-10-24",43,202443]
[null,null,"2024-10-25",43,202443]
[null,null,"2024-10-26",43,202443]
[null,null,"2024-10-27",43,202443]
[null,null,"2024-10-28",44,202444]
[null,null,"2024-10-29",44,202444]
[null,null,"2024-10-30",44,202444]
[null,null,"2024-10-31",44,202444]
[null,null,"2024-11-01",44,202444]
[null,null,"2024-11-02",44,202444]
[null,null,"2024-11-03",44,202444]
[null,null,"2024-11-04",45,202445]
[null,null,"2024-11-05",45,202445]
[null,null,"2024-11-06",45,202445]
[null,null,"2024-11-07",45,202445]
[null,null,"2024-11-08",45,202445]
[null,null,"2024-11-09",45,202445]
[null,null,"2024-11-10",45,202445]
[null,null,"2024-11-11",46,202446]
[null,null,"2024-11-12",46,202446]
[null,null,"2024-11-13",46,202446]
[null,null,"2024-11-14",46,202446]
[null,null,"2024-11-15",46,202446]
[null,null,"2024-11-16",46,202446]
[null,null,"2024-11-17",46,202446]
[null,null,"2024-11-18",47,202447]
[null,null,"2024-11-19",47,202447]
[null,null,"2024-11-20",47,202447]
[null,null,"2024-11-21",47,202447]
[null,null,"2024-11-22",47,202447]
[null,null,"2024-11-23",47,202447]
[null,null,"2024-11-24",47,202447]
[null,null,"2024-11-25",48,202448]
[null,null,"2024-11-26",48,202448]
[null,null,"2024-11-27",48,202448]
[null,null,"2024-11-28",48,202448]
[null,null,"2024-11-29",48,202448]
[null,null,"2024-11-30",48,202448]
[null,null,"2024-12-01",48,202448]
[null,null,"2024-12-02",49,202449]
[null,null,"2024-12-03",49,202449]
[null,null,"2024-12-04",49,202449]
[null,null,"2024-12-05",49,202449]
[null,null,"2024-12-06",49,202449]
[null,null,"2024-12-07",49,202449]
[null,null,"2024-12-08",49,202449]
[null,null,"2024-12-09",50,202450]
[null,null,"2024-12-10",50,202450]
[null,null,"2024-12-11",50,202450]
[null,null,"2024-12-12",50,202450]
[null,null,"2024-12-13",50,202450]
[null,null,"2024-12-14",50,202450]
[null,null,"2024-12-15",50,202450]
[null,null,"2024-12-16",51,202451]
[null,null,"2024-12-17",51,202451]
[null,null,"2024-12-18",51,202451]
[null,null,"2024-12-19",51,202451]
[null,null,"2024-12-20",51,202451]
[null,null,"2024-12-21",51,202451]
[null,null,"2024-12-22",51,202451]
[null,null,"2024-12-23",52,202452]
[null,null,"2024-12-24",52,202452]
[null,null,"2024-12-25",52,202452]
[null,null,"2024-12-26",52,202452]
[null,null,"2024-12-27",52,202452]
[null,null,"2024-12-28",52,202452]
[null,null,"2024-12-29",52,202452]
[null,null,"2024-12-30",52,202452]
[null,null,"2024-12-31",52,202452]
[null,null,"2025-01-01",1,202501]
[null,null,"2025-01-02",1,202501]
[null,null,"2025-01-03",1,202501]
[null,null,"2025-01-04",1,202501]
[null,null,"2025-01-05",1,202501]
[null,null,"2025-01-06",2,202502]
[null,null,"2025-01-07",2,202502]
[null,null,"2025-01-08",2,202502]
[null,null,"2025-01-09",2,202502]
[null,null,"2025-01-10",2,202502]
[null,null,"2025-01-11",2,202502]
[null,null,"2025-01-12",2,202502]
[null,null,"2025-01-13",3,202503]
[null,null,"2025-01-14",3,202503]
[null,null,"2025-01-15",3,202503]
[null,null,"2025-01-16",3,202503]
[null,null,"2025-01-17",3,202503]
[null,null,"2025-01-18",3,202503]
[null,null,"2025-01-19",3,202503]
[null,null,"2025-01-20",4,202504]
[null,null,"2025-01-21",4,202504]
[null,null,"2025-01-22",4,202504]
[null,null,"2025-01-23",4,202504]
[null,null,"2025-01-24",4,202504]
[null,null,"2025-01-25",4,202504]
[null,null,"2025-01-26",4,202504]
[null,null,"2025-01-27",5,202505]
[null,null,"2025-01-28",5,202505]
[null,null,"2025-01-29",5,202505]
[null,null,"2025-01-30",5,202505]
[null,null,"2025-01-31",5,202505]
[null,null,"2025-02-01",5,202505]
[null,null,"2025-02-02",5,202505]
[null,null,"2025-02-03",6,202506]
[null,null,"2025-02-04",6,202506]
[null,null,"2025-02-05",6,202506]
[null,null,"2025-02-06",6,202506]
[null,null,"2025-02-07",6,202506]
[null,null,"2025-02-08",6,202506]
[null,null,"2025-02-09",6,202506]
[null,null,"2025-02-10",7,202507]
[null,null,"2025-02-11",7,202507]
[null,null,"2025-02-12",7,202507]
[null,null,"2025-02-13",7,202507]
[null,null,"2025-02-14",7,202507]
[null,null,"2025-02-15",7,202507]
[null,null,"2025-02-16",7,202507]
[null,null,"2025-02-17",8,202508]
[null,null,"2025-02-18",8,202508]
[null,null,"2025-02-19",8,202508]
[null,null,"2025-02-20",8,202508]
[null,null,"2025-02-21",8,202508]
[null,null,"2025-02-22",8,202508]
[null,null,"2025-02-23",8,202508]
[null,null,"2025-02-24",9,202509]
[null,null,"2025-02-25",9,202509]
[null,null,"2025-02-26",9,202509]
[null,null,"2025-02-27",9,202509]
[null,null,"2025-02-28",9,202509]
[null,null,"2025-03-01",9,202509]
[null,null,"2025-03-02",9,202509]
[null,null,"2025-03-03",10,202510]
[null,null,"2025-03-04",10,202510]
[null,null,"2025-03-05",10,202510]
[null,null,"2025-03-06",10,202510]
[null,null,"2025-03-07",10,202510]
[null,null,"2025-03-08",10,202510]
[null,null,"2025-03-09",10,202510]
[null,null,"2025-03-10",11,202511]
[null,null,"2025-03-11",11,202511]
[null,null,"2025-03-12",11,202511]
[null,null,"2025-03-13",11,202511]
[null,null,"2025-03-14",11,202511]
[null,null,"2025-03-15",11,202511]
[null,null,"2025-03-16",11,202511]
[null,null,"2025-03-17",12,202512]
[null,null,"2025-03-18",12,202512]
[null,null,"2025-03-19",12,202512]
[null,null,"2025-03-20",12,202512]
[null,null,"2025-03-21",12,202512]
[null,null,"2025-03-22",12,202512]
[null,null,"2025-03-23",12,202512]
[null,null,"2025-03-24",13,202513]
[null,null,"2025-03-25",13,202513]
[null,null,"2025-03-26",13,202513]
[null,null,"2025-03-27",13,202513]
[null,null,"2025-03-28",13,202513]
[null,null,"2025-03-29",13,202513]
[null,null,"2025-03-30",13,202513]
[null,null,"2025-03-31",14,202514]
[null,null,"2025-04-01",14,202514]
[null,null,"2025-04-02",14,202514]
[null,null,"2025-04-03",14,202514]
[null,null,"2025-04-04",14,202514]
[null,null,"2025-04-05",14,202514]
[null,null,"2025-04-06",14,202514]
[null,null,"2025-04-07",15,202515]
[null,null,"2025-04-08",15,202515]
[null,null,"2025-04-09",15,202515]
[null,null,"2025-04-10",15,202515]
[null,null,"2025-04-11",15,202515]
[null,null,"2025-04-12",15,202515]
[null,null,"2025-04-13",15,202515]
[null,null,"2025-04-14",16,202516]
[null,null,"2025-04-15",16,202516]
[null,null,"2025-04-16",16,202516]
[null,null,"2025-04-17",16,202516]
[null,null,"2025-04-18",16,202516]
[null,null,"2025-04-19",16,202516]
[null,null,"2025-04-20",16,202516]
[null,null,"2025-04-21",17,202517]
[null,null,"2025-04-22",17,202517]
[null,null,"2025-04-23",17,202517]
[null,null,"2025-04-24",17,202517]
[null,null,"2025-04-25",17,202517]
[null,null,"2025-04-26",17,202517]
[null,null,"2025-04-27",17,202517]
[null,null,"2025-04-28",18,202518]
[null,null,"2025-04-29",18,202518]
[null,null,"2025-04-30",18,202518]
[null,null,"2025-05-01",18,202518]
[null,null,"2025-05-02",18,202518]
[null,null,"2025-05-03",18,202518]
[null,null,"2025-05-04",18,202518]
[null,null,"2025-05-05",19,202519]
[null,null,"2025-05-06",19,202519]
[null,null,"2025-05-07",19,202519]
[null,null,"2025-05-08",19,202519]
[null,null,"2025-05-09",19,202519]
[null,null,"2025-05-10",19,202519]
[null,null,"2025-05-11",19,202519]
[null,null,"2025-05-12",20,202520]
[null,null,"2025-05-13",20,202520]
[null,null,"2025-05-14",20,202520]
[null,null,"2025-05-15",20,202520]
[null,null,"2025-05-16",20,202520]
[null,null,"2025-05-17",20,202520]
[null,null,"2025-05-18",20,202520]
[null,null,"2025-05-19",21,202521]
[null,null,"2025-05-20",21,202521]
[null,null,"2025-05-21",21,202521]
[null,null,"2025-05-22",21,202521]
[null,null,"2025-05-23",21,202521]
[null,null,"2025-05-24",21,202521]
[null,null,"2025-05-25",21,202521]
[null,null,"2025-05-26",22,202522]
[null,null,"2025-05-27",22,202522]
[null,null,"2025-05-28",22,202522]
[null,null,"2025-05-29",22,202522]
[null,null,"2025-05-30",22,202522]
[null,null,"2025-05-31",22,202522]
[null,null,"2025-06-01",22,202522]
[null,null,"2025-06-02",23,202523]
[null,null,"2025-06-03",23,202523]
[null,null,"2025-06-04",23,202523]
[null,null,"2025-06-05",23,202523]
[null,null,"2025-06-06",23,202523]
[null,null,"2025-06-07",23,202523]
[null,null,"2025-06-08",23,202523]
[null,null,"2025-06-09",24,202524]
[null,null,"2025-06-10",24,202524]
[null,null,"2025-06-11",24,202524]
[null,null,"2025-06-12",24,202524]
[null,null,"2025-06-13",24,202524]
[null,null,"2025-06-14",24,202524]
[null,null,"2025-06-15",24,202524]
[null,null,"2025-06-16",25,202525]
[null,null,"2025-06-17",25,202525]
[null,null,"2025-06-18",25,202525]
[null,null,"2025-06-19",25,202525]
[null,null,"2025-06-20",25,202525]
[null,null,"2025-06-21",25,202525]
[null,null,"2025-06-22",25,202525]
[null,null,"2025-06-23",26,202526]
[null,null,"2025-06-24",26,202526]
[null,null,"2025-06-25",26,202526]
[null,null,"2025-06-26",26,202526]
[null,null,"2025-06-27",26,202526]
[null,null,"2025-06-28",26,202526]
[null,null,"2025-06-29",26,202526]
[null,null,"2025-06-30",27,202527]
[null,null,"2025-07-01",27,202527]
[null,null,"2025-07-02",27,202527]
[null,null,"2025-07-03",27,202527]
[null,null,"2025-07-04",27,202527]
[null,null,"2025-07-05",27,202527]
[null,null,"2025-07-06",27,202527]
[null,null,"2025-07-07",28,202528]
[null,null,"2025-07-08",28,202528]
[null,null,"2025-07-09",28,202528]
[null,null,"2025-07-10",28,202528]
[null,null,"2025-07-11",28,202528]
[null,null,"2025-07-12",28,202528]
[null,null,"2025-07-13",28,202528]
[null,null,"2025-07-14",29,202529]
[null,null,"2025-07-15",29,202529]
[null,null,"2025-07-16",29,202529]
[null,null,"2025-07-17",29,202529]
[null,null,"2025-07-18",29,202529]
[null,null,"2025-07-19",29,202529]
[null,null,"2025-07-20",29,202529]
[null,null,"2025-07-21",30,202530]
[null,null,"2025-07-22",30,202530]
[null,null,"2025-07-23",30,202530]
[null,null,"2025-07-24",30,202530]
[null,null,"2025-07-25",30,202530]
[null,null,"2025-07-26",30,202530]
[null,null,"2025-07-27",30,202530]
[null,null,"2025-07-28",31,202531]
[null,null,"2025-07-29",31,202531]
[null,null,"2025-07-30",31,202531]
[null,null,"2025-07-31",31,202531]
[null,null,"2025-08-01",31,202531]
[null,null,"2025-08-02",31,202531]
[null,null,"2025-08-03",31,202531]
[null,null,"2025-08-04",32,202532]
[null,null,"2025-08-05",32,202532]
[null,null,"2025-08-06",32,202532]
[null,null,"2025-08-07",32,202532]
[null,null,"2025-08-08",32,202532]
[null,null,"2025-08-09",32,202532]
[null,null,"2025-08-10",32,202532]
[null,null,"2025-08-11",33,202533]
[null,null,"2025-08-12",33,202533]
[null,null,"2025-08-13",33,202533]
[null,null,"2025-08-14",33,202533]
[null,null,"2025-08-15",33,202533]
[null,null,"2025-08-16",33,202533]
[null,null,"2025-08-17",33,202533]
[null,null,"2025-08-18",34,202534]
[null,null,"2025-08-19",34,202534]
[null,null,"2025-08-20",34,202534]
[null,null,"2025-08-21",34,202534]
[null,null,"2025-08-22",34,202534]
[null,null,"2025-08-23",34,202534]
[null,null,"2025-08-24",34,202534]
[null,null,"2025-08-25",35,202535]
[null,null,"2025-08-26",35,202535]
[null,null,"2025-08-27",35,202535]
[null,null,"2025-08-28",35,202535]
[null,null,"2025-08-29",35,202535]
[null,null,"2025-08-30",35,202535]
[null,null,"2025-08-31",35,202535]
[null,null,"2025-09-01",36,202536]
[null,null,"2025-09-02",36,202536]
[null,null,"2025-09-03",36,202536]
[null,null,"2025-09-04",36,202536]
[null,null,"2025-09-05",36,202536]
[null,null,"2025-09-06",36,202536]
[null,null,"2025-09-07",36,202536]
[null,null,"2025-09-08",37,202537]
[null,null,"2025-09-09",37,202537]
[null,null,"2025-09-10",37,202537]
[null,null,"2025-09-11",37,202537]
[null,null,"2025-09-12",37,202537]
[null,null,"2025-09-13",37,202537]
[null,null,"2025-09-14",37,202537]
[null,null,"2025-09-15",38,202538]
[null,null,"2025-09-16",38,202538]
[null,null,"2025-09-17",38,202538]
[null,null,"2025-09-18",38,202538]
[null,null,"2025-09-19",38,202538]
[null,null,"2025-09-20",38,202538]
[null,null,"2025-09-21",38,202538]
[null,null,"2025-09-22",39,202539]
[null,null,"2025-09-23",39,202539]
[null,null,"2025-09-24",39,202539]
[null,null,"2025-09-25",39,202539]
[null,null,"2025-09-26",39,202539]
[null,null,"2025-09-27",39,202539]
[null,null,"2025-09-28",39,202539]
[null,null,"2025-09-29",40,202540]
[null,null,"2025-09-30",40,202540]
[null,null,"2025-10-01",40,202540]
[null,null,"2025-10-02",40,202540]
[null,null,"2025-10-03",40,202540]
[null,null,"2025-10-04",40,202540]
[null,null,"2025-10-05",40,202540]
[null,null,"2025-10-06",41,202541]
[null,null,"2025-10-07",41,202541]
[null,null,"2025-10-08",41,202541]
[null,null,"2025-10-09",41,202541]
[null,null,"2025-10-10",41,202541]
[null,null,"2025-10-11",41,202541]
[null,null,"2025-10-12",41,202541]
[null,null,"2025-10-13",42,202542]
[null,null,"2025-10-14",42,202542]
[null,null,"2025-10-15",42,202542]
[null,null,"2025-10-16",42,202542]
[null,null,"2025-10-17",42,202542]
[null,null,"2025-10-18",42,202542]
[null,null,"2025-10-19",42,202542]
[null,null,"2025-10-20",43,202543]
[null,null,"2025-10-21",43,202543]
[null,null,"2025-10-22",43,202543]
[null,null,"2025-10-23",43,202543]
[null,null,"2025-10-24",43,202543]
[null,null,"2025-10-25",43,202543]
[null,null,"2025-10-26",43,202543]
[null,null,"2025-10-27",44,202544]
[null,null,"2025-10-28",44,202544]
[null,null,"2025-10-29",44,202544]
[null,null,"2025-10-30",44,202544]
[null,null,"2025-10-31",44,202544]
[null,null,"2025-11-01",44,202544]
[null,null,"2025-11-02",44,202544]
[null,null,"2025-11-03",45,202545]
[null,null,"2025-11-04",45,202545]
[null,null,"2025-11-05",45,202545]
[null,null,"2025-11-06",45,202545]
[null,null,"2025-11-07",45,202545]
[null,null,"2025-11-08",45,202545]
[null,null,"2025-11-09",45,202545]
[null,null,"2025-11-10",46,202546]
[null,null,"2025-11-11",46,202546]
[null,null,"2025-11-12",46,202546]
[null,null,"2025-11-13",46,202546]
[null,null,"2025-11-14",46,202546]
[null,null,"2025-11-15",46,202546]
[null,null,"2025-11-16",46,202546]
[null,null,"2025-11-17",47,202547]
[null,null,"2025-11-18",47,202547]
[null,null,"2025-11-19",47,202547]
[null,null,"2025-11-20",47,202547]
[null,null,"2025-11-21",47,202547]
[null,null,"2025-11-22",47,202547]
[null,null,"2025-11-23",47,202547]
[null,null,"2025-11-24",48,202548]
[null,null,"2025-11-25",48,202548]
[null,null,"2025-11-26",48,202548]
[null,null,"2025-11-27",48,202548]
[null,null,"2025-11-28",48,202548]
[null,null,"2025-11-29",48,202548]
[null,null,"2025-11-30",48,202548]
[null,null,"2025-12-01",49,202549]
[null,null,"2025-12-02",49,202549]
[null,null,"2025-12-03",49,202549]
[null,null,"2025-12-04",49,202549]
[null,null,"2025-12-05",49,202549]
[null,null,"2025-12-06",49,202549]
[null,null,"2025-12-07",49,202549]
[null,null,"2025-12-08",50,202550]
[null,null,"2025-12-09",50,202550]
[null,null,"2025-12-10",50,202550]
[null,null,"2025-12-11",50,202550]
[null,null,"2025-12-12",50,202550]
[null,null,"2025-12-13",50,202550]
[null,null,"2025-12-14",50,202550]
[null,null,"2025-12-15",51,202551]
[null,null,"2025-12-16",51,202551]
[null,null,"2025-12-17",51,202551]
[null,null,"2025-12-18",51,202551]
[null,null,"2025-12-19",51,202551]
[null,null,"2025-12-20",51,202551]
[null,null,"2025-12-21",51,202551]
[null,null,"2025-12-22",52,202552]
[null,null,"2025-12-23",52,202552]
[null,null,"2025-12-24",52,202552]
[null,null,"2025-12-25",52,202552]
[null,null,"2025-12-26",52,202552]
[null,null,"2025-12-27",52,202552]
[null,null,"2025-12-28",52,202552]
[null,null,"2025-12-29",52,202552]
[null,null,"2025-12-30",52,202552]
[null,null,"2025-12-31",52,202552]

{"sheet":"Overzicht projecten","index":5,"n_rows":10,"n_cols":64,"rows_kept":10,"cut":false,"hidden":false,"merged":[]}
[null,null,null,null,null,null,null,null,null,null,null,null,null,null,null,null,null,null,null,null,null,null,null,null,null,null,null,null,null,null,null,null,null,null,null,null,null,null,null,null,null,null,null,null,null,null,null,null,null,null,null,null,null,null,null,null,null,null,null,null,null,null,null,{"$f":"Lijsten!F1","v":2016}]
[null,null,null,null,null,null,null,null,null,null,null,null,null,null,null,null,null,null,null,null,null,null,null,null,null,null,null,null,null,null,null,null,null,null,null,null,null,null,null,null,null,null,null,null,null,null,null,null,null,null,null,null,null,null,null,null,null,null,null,null,null,null,null,{"$f":"Lijsten!F2","v":2017}]
[null,null,null,null,null,null,null,null,null,null,null,null,null,null,null,null,null,null,null,null,null,null,null,null,null,null,null,null,null,null,null,null,null,null,null,null,null,null,null,null,null,null,null,null,null,null,null,null,null,null,null,null,null,null,null,null,null,null,null,null,null,null,null,{"$f":"Lijsten!F3","v":2018}]
["Jaar",null,null,null,null,null,null,null,null,null,null,null,null,null,null,null,null,null,null,null,null,null,null,null,null,null,null,null,null,null,null,null,null,null,null,null,null,null,null,null,null,null,null,null,null,null,null,null,null,null,null,null,null,null,null,null,null,null,null,null,null,null,null,{"$f":"Lijsten!F4","v":2019}]
[null,null,null,null,null,null,null,null,null,null,{"$f":"IF(Lijsten!A2=0,\"\",Lijsten!A2)","v":"In voorbereiding"},null,null,null,null,null,{"$f":"IF(Lijsten!A3=0,\"\",Lijsten!A3)","v":"Lopend"},null,null,null,null,null,{"$f":"IF(Lijsten!A4=0,\"\",Lijsten!A4)","v":"Afgerond"},null,null,null,null,null,{"$f":"IF(Lijsten!A5=0,\"\",Lijsten!A5)","v":""},null,null,null,null,null,{"$f":"IF(Lijsten!A6=0,\"\",Lijsten!A6)","v":""},null,null,null,null,null,null,null,null,null,null,null,null,null,null,null,null,null,null,null,null,null,null,null,null,null,null,null,null,{"$f":"Lijsten!F5","v":2020}]
[null,null,null,null,null,null,null,null,null,null,null,null,null,null,null,null,null,null,null,null,null,null,null,null,null,null,null,null,null,null,null,null,null,null,null,null,null,null,null,null,null,null,null,null,null,null,null,null,null,null,null,null,null,null,null,null,null,null,null,null,null,null,null,{"$f":"Lijsten!F6","v":2021}]
["Projecttitel","Start datum","Eind datum","Status","Verantwoordelijke","Projectleden","Uren project","Kosten","Opmerkingen",1,2,3,4,5,6,7,8,9,10,11,12,13,14,15,16,17,18,19,20,21,22,23,24,25,26,27,28,29,30,31,32,33,34,35,36,37,38,39,40,41,42,43,44,45,46,47,48,49,50,51,52,53,null,{"$f":"Lijsten!F7","v":2022}]
[null,null,null,null,null,null,null,null,null,null,null,null,null,null,null,null,null,null,null,null,null,null,null,null,null,null,null,null,null,null,null,null,null,null,null,null,null,null,null,null,null,null,null,null,null,null,null,null,null,null,null,null,null,null,null,null,null,null,null,null,null,null,null,{"$f":"Lijsten!F8","v":2023}]
[null,null,null,null,null,null,null,null,null,null,null,null,null,null,null,null,null,null,null,null,null,null,null,null,null,null,null,null,null,null,null,null,null,null,null,null,null,null,null,null,null,null,null,null,null,null,null,null,null,null,null,null,null,null,null,null,null,null,null,null,null,null,null,{"$f":"Lijsten!F9","v":2024}]
[null,null,null,null,null,null,null,null,null,null,null,null,null,null,null,null,null,null,null,null,null,null,null,null,null,null,null,null,null,null,null,null,null,null,null,null,null,null,null,null,null,null,null,null,null,null,null,null,null,null,null,null,null,null,null,null,null,null,null,null,null,null,null,{"$f":"Lijsten!F10","v":2025}]

{"sheet":"Overzicht per project","index":6,"n_rows":10,"n_cols":64,"rows_kept":10,"cut":false,"hidden":false,"merged":[]}
[null,null,null,null,null,null,null,null,null,null,null,null,null,null,null,null,null,null,null,null,null,null,null,null,null,null,null,null,null,null,null,null,null,null,null,null,null,null,null,null,null,null,null,null,null,null,null,null,null,null,null,null,null,null,null,null,null,null,null,null,null,null,null,{"$f":"Lijsten!F1","v":2016}]
["Jaar",null,null,null,null,null,null,null,null,null,null,null,null,null,null,null,null,null,null,null,null,null,null,null,null,null,null,null,null,null,null,null,null,null,null,null,null,null,null,null,null,null,null,null,null,null,null,null,null,null,null,null,null,null,null,null,null,null,null,null,null,null,null,{"$f":"Lijsten!F2","v":2017}]
[null,null,null,null,null,null,null,null,null,null,null,null,null,null,null,null,null,null,null,null,null,null,null,null,null,null,null,null,null,null,null,null,null,null,null,null,null,null,null,null,null,null,null,null,null,null,null,null,null,null,null,null,null,null,null,null,null,null,null,null,null,null,null,{"$f":"Lijsten!F3","v":2018}]
[null,null,null,null,null,null,null,null,null,null,null,null,null,null,null,null,null,null,null,null,null,null,null,null,null,null,null,null,null,null,null,null,null,null,null,null,null,null,null,null,null,null,null,null,null,null,null,null,null,null,null,null,null,null,null,null,null,null,null,null,null,null,null,{"$f":"Lijsten!F4","v":2019}]
["Project",null,null,null,null,null,null,null,null,null,{"$f":"IF(Lijsten!A2=0,\"\",Lijsten!A2)","v":"In voorbereiding"},null,null,null,null,null,{"$f":"IF(Lijsten!A3=0,\"\",Lijsten!A3)","v":"Lopend"},null,null,null,null,null,{"$f":"IF(Lijsten!A4=0,\"\",Lijsten!A4)","v":"Afgerond"},null,null,null,null,null,{"$f":"IF(Lijsten!A5=0,\"\",Lijsten!A5)","v":""},null,null,null,null,null,{"$f":"IF(Lijsten!A6=0,\"\",Lijsten!A6)","v":""},null,null,null,null,null,null,null,null,null,null,null,null,null,null,null,null,null,null,null,null,null,null,null,null,null,null,null,null,{"$f":"Lijsten!F5","v":2020}]
[null,null,null,{"$f":"COUNTIFS(Acties!A:A,A6)","v":0},null,null,null,null,null,null,null,null,null,null,null,null,null,null,null,null,null,null,null,null,null,null,null,null,null,null,null,null,null,null,null,null,null,null,null,null,null,null,null,null,null,null,null,null,null,null,null,null,null,null,null,null,null,null,null,null,null,null,null,{"$f":"Lijsten!F6","v":2021}]
[null,null,null,null,null,null,null,null,null,null,null,null,null,null,null,null,null,null,null,null,null,null,null,null,null,null,null,null,null,null,null,null,null,null,null,null,null,null,null,null,null,null,null,null,null,null,null,null,null,null,null,null,null,null,null,null,null,null,null,null,null,null,null,{"$f":"Lijsten!F7","v":2022}]
["Actie","Start datum","Eind datum","Status","Verantwoordelijke","Uitvoerende","Uren actie","Kosten","Opmerkingen",1,2,3,4,5,6,7,8,9,10,11,12,13,14,15,16,17,18,19,20,21,22,23,24,25,26,27,28,29,30,31,32,33,34,35,36,37,38,39,40,41,42,43,44,45,46,47,48,49,50,51,52,53,null,{"$f":"Lijsten!F8","v":2023}]
[null,null,null,null,null,null,null,null,null,null,null,null,null,null,null,null,null,null,null,null,null,null,null,null,null,null,null,null,null,null,null,null,null,null,null,null,null,null,null,null,null,null,null,null,null,null,null,null,null,null,null,null,null,null,null,null,null,null,null,null,null,null,null,{"$f":"Lijsten!F9","v":2024}]
[null,null,null,null,null,null,null,null,null,null,null,null,null,null,null,null,null,null,null,null,null,null,null,null,null,null,null,null,null,null,null,null,null,null,null,null,null,null,null,null,null,null,null,null,null,null,null,null,null,null,null,null,null,null,null,null,null,null,null,null,null,null,null,{"$f":"Lijsten!F10","v":2025}]

{"sheet":"Rapportage medewerker","index":7,"n_rows":250,"n_cols":28,"rows_kept":250,"cut":false,"hidden":false,"merged":[]}
[null,null,null,null,null,null,null,null,null,null,null,null,null,null,null,null,null,null,null,null,null,null,null,null,null,null,null,{"$f":"Medewerkers!A2","v":" "}]
["Medewerker",null,null,null,null,null,null,null,null,null,null,null,null,null,null,null,null,null,null,null,null,null,null,null,null,null,null,{"$f":"Medewerkers!A3","v":" "}]
[null,null,null,null,null,null,null,null,null,null,null,null,null,null,null,null,null,null,null,null,null,null,null,null,null,null,null,{"$f":"Medewerkers!A4","v":" "}]
[null,null,null,null,null,null,null,null,null,null,null,null,null,null,null,null,null,null,null,null,null,null,null,null,null,null,null,{"$f":"Medewerkers!A5","v":" "}]
["Project of actie",null,null,null,null,null,null,null,null,null,null,null,null,null,null,null,null,null,null,null,null,null,null,null,null,null,null,{"$f":"Medewerkers!A6","v":" "}]
[null,null,null,{"$f":"IF(A6=\"\",0,IF(A6=\"Project\",COUNTIFS(Planning!E:E,A3)+COUNTIFS(Planning!F:F,A3)+COUNTIFS(Planning!G:G,A3)+COUNTIFS(Planning!H:H,A3)+COUNTIFS(Planning!I:I,A3)+COUNTIFS(Planning!J:J,A3)+COUNTIFS(Planning!K:K,A3)+COUNTIFS(Planning!L:L,A3)+COUNTIFS(Planning!M:M,A3)+COUNTIFS(Planning!N:N,A3)+COUNTIFS(Planning!O:O,A3),COUNTIFS(Acties!F:F,A3)+COUNTIFS(Acties!G:G,A3)+COUNTIFS(Acties!H:H,A3)+COUNTIFS(Acties!I:I,A3)+COUNTIFS(Acties!J:J,A3)+COUNTIFS(Acties!K:K,A3)+COUNTIFS(Acties!L:L,A3)+COUNTIFS(Acties!M:M,A3)+COUNTIFS(Acties!N:N,A3)+COUNTIFS(Acties!O:O,A3)+COUNTIFS(Acties!P:P,A3)))","v":0},null,null,null,null,null,null,null,null,null,null,null,null,null,null,null,null,null,null,null,null,null,null,null,{"$f":"Medewerkers!A7","v":" "}]
[null,null,null,null,null,null,null,null,null,null,null,null,null,null,null,null,null,null,null,null,null,null,null,null,null,null,null,{"$f":"Medewerkers!A8","v":" "}]
[null,null,null,null,null,null,null,null,null,null,null,null,null,null,null,null,null,null,null,null,null,null,null,null,null,null,null,{"$f":"Medewerkers!A9","v":" "}]
["Projecttitel","Actie","Start datum","Eind datum","Status","Verantwoordelijke","Uitvoerende","Uren project / actie","Kosten","Opmerkingen",null,null,null,null,null,null,null,null,null,null,null,null,null,null,null,null,null,{"$f":"Medewerkers!A10","v":" "}]
[null,null,null,null,null,null,null,null,null,null,null,null,null,null,null,null,null,null,null,null,null,null,null,null,null,null,null,{"$f":"Medewerkers!A11","v":" "}]
[null,null,null,null,null,null,null,null,null,null,null,null,null,null,null,null,null,null,null,null,null,null,null,null,null,null,null,{"$f":"Medewerkers!A12","v":" "}]
[null,null,null,null,null,null,null,null,null,null,null,null,null,null,null,null,null,null,null,null,null,null,null,null,null,null,null,{"$f":"Medewerkers!A13","v":" "}]
[null,null,null,null,null,null,null,null,null,null,null,null,null,null,null,null,null,null,null,null,null,null,null,null,null,null,null,{"$f":"Medewerkers!A14","v":" "}]
[null,null,null,null,null,null,null,null,null,null,null,null,null,null,null,null,null,null,null,null,null,null,null,null,null,null,null,{"$f":"Medewerkers!A15","v":" "}]
[null,null,null,null,null,null,null,null,null,null,null,null,null,null,null,null,null,null,null,null,null,null,null,null,null,null,null,{"$f":"Medewerkers!A16","v":" "}]
[null,null,null,null,null,null,null,null,null,null,null,null,null,null,null,null,null,null,null,null,null,null,null,null,null,null,null,{"$f":"Medewerkers!A17","v":" "}]
[null,null,null,null,null,null,null,null,null,null,null,null,null,null,null,null,null,null,null,null,null,null,null,null,null,null,null,{"$f":"Medewerkers!A18","v":" "}]
[null,null,null,null,null,null,null,null,null,null,null,null,null,null,null,null,null,null,null,null,null,null,null,null,null,null,null,{"$f":"Medewerkers!A19","v":" "}]
[null,null,null,null,null,null,null,null,null,null,null,null,null,null,null,null,null,null,null,null,null,null,null,null,null,null,null,{"$f":"Medewerkers!A20","v":" "}]
[null,null,null,null,null,null,null,null,null,null,null,null,null,null,null,null,null,null,null,null,null,null,null,null,null,null,null,{"$f":"Medewerkers!A21","v":" "}]
[null,null,null,null,null,null,null,null,null,null,null,null,null,null,null,null,null,null,null,null,null,null,null,null,null,null,null,{"$f":"Medewerkers!A22","v":" "}]
[null,null,null,null,null,null,null,null,null,null,null,null,null,null,null,null,null,null,null,null,null,null,null,null,null,null,null,{"$f":"Medewerkers!A23","v":" "}]
[null,null,null,null,null,null,null,null,null,null,null,null,null,null,null,null,null,null,null,null,null,null,null,null,null,null,null,{"$f":"Medewerkers!A24","v":" "}]
[null,null,null,null,null,null,null,null,null,null,null,null,null,null,null,null,null,null,null,null,null,null,null,null,null,null,null,{"$f":"Medewerkers!A25","v":" "}]
[null,null,null,null,null,null,null,null,null,null,null,null,null,null,null,null,null,null,null,null,null,null,null,null,null,null,null,{"$f":"Medewerkers!A26","v":" "}]
[null,null,null,null,null,null,null,null,null,null,null,null,null,null,null,null,null,null,null,null,null,null,null,null,null,null,null,{"$f":"Medewerkers!A27","v":" "}]
[null,null,null,null,null,null,null,null,null,null,null,null,null,null,null,null,null,null,null,null,null,null,null,null,null,null,null,{"$f":"Medewerkers!A28","v":" "}]
[null,null,null,null,null,null,null,null,null,null,null,null,null,null,null,null,null,null,null,null,null,null,null,null,null,null,null,{"$f":"Medewerkers!A29","v":" "}]
[null,null,null,null,null,null,null,null,null,null,null,null,null,null,null,null,null,null,null,null,null,null,null,null,null,null,null,{"$f":"Medewerkers!A30","v":" "}]
[null,null,null,null,null,null,null,null,null,null,null,null,null,null,null,null,null,null,null,null,null,null,null,null,null,null,null,{"$f":"Medewerkers!A31","v":" "}]
[null,null,null,null,null,null,null,null,null,null,null,null,null,null,null,null,null,null,null,null,null,null,null,null,null,null,null,{"$f":"Medewerkers!A32","v":" "}]
[null,null,null,null,null,null,null,null,null,null,null,null,null,null,null,null,null,null,null,null,null,null,null,null,null,null,null,{"$f":"Medewerkers!A33","v":" "}]
[null,null,null,null,null,null,null,null,null,null,null,null,null,null,null,null,null,null,null,null,null,null,null,null,null,null,null,{"$f":"Medewerkers!A34","v":" "}]
[null,null,null,null,null,null,null,null,null,null,null,null,null,null,null,null,null,null,null,null,null,null,null,null,null,null,null,{"$f":"Medewerkers!A35","v":" "}]
[null,null,null,null,null,null,null,null,null,null,null,null,null,null,null,null,null,null,null,null,null,null,null,null,null,null,null,{"$f":"Medewerkers!A36","v":" "}]
[null,null,null,null,null,null,null,null,null,null,null,null,null,null,null,null,null,null,null,null,null,null,null,null,null,null,null,{"$f":"Medewerkers!A37","v":" "}]
[null,null,null,null,null,null,null,null,null,null,null,null,null,null,null,null,null,null,null,null,null,null,null,null,null,null,null,{"$f":"Medewerkers!A38","v":" "}]
[null,null,null,null,null,null,null,null,null,null,null,null,null,null,null,null,null,null,null,null,null,null,null,null,null,null,null,{"$f":"Medewerkers!A39","v":" "}]
[null,null,null,null,null,null,null,null,null,null,null,null,null,null,null,null,null,null,null,null,null,null,null,null,null,null,null,{"$f":"Medewerkers!A40","v":" "}]
[null,null,null,null,null,null,null,null,null,null,null,null,null,null,null,null,null,null,null,null,null,null,null,null,null,null,null,{"$f":"Medewerkers!A41","v":" "}]
[null,null,null,null,null,null,null,null,null,null,null,null,null,null,null,null,null,null,null,null,null,null,null,null,null,null,null,{"$f":"Medewerkers!A42","v":" "}]
[null,null,null,null,null,null,null,null,null,null,null,null,null,null,null,null,null,null,null,null,null,null,null,null,null,null,null,{"$f":"Medewerkers!A43","v":" "}]
[null,null,null,null,null,null,null,null,null,null,null,null,null,null,null,null,null,null,null,null,null,null,null,null,null,null,null,{"$f":"Medewerkers!A44","v":" "}]
[null,null,null,null,null,null,null,null,null,null,null,null,null,null,null,null,null,null,null,null,null,null,null,null,null,null,null,{"$f":"Medewerkers!A45","v":" "}]
[null,null,null,null,null,null,null,null,null,null,null,null,null,null,null,null,null,null,null,null,null,null,null,null,null,null,null,{"$f":"Medewerkers!A46","v":" "}]
[null,null,null,null,null,null,null,null,null,null,null,null,null,null,null,null,null,null,null,null,null,null,null,null,null,null,null,{"$f":"Medewerkers!A47","v":" "}]
[null,null,null,null,null,null,null,null,null,null,null,null,null,null,null,null,null,null,null,null,null,null,null,null,null,null,null,{"$f":"Medewerkers!A48","v":" "}]
[null,null,null,null,null,null,null,null,null,null,null,null,null,null,null,null,null,null,null,null,null,null,null,null,null,null,null,{"$f":"Medewerkers!A49","v":" "}]
[null,null,null,null,null,null,null,null,null,null,null,null,null,null,null,null,null,null,null,null,null,null,null,null,null,null,null,{"$f":"Medewerkers!A50","v":" "}]
[null,null,null,null,null,null,null,null,null,null,null,null,null,null,null,null,null,null,null,null,null,null,null,null,null,null,null,{"$f":"Medewerkers!A51","v":" "}]
[null,null,null,null,null,null,null,null,null,null,null,null,null,null,null,null,null,null,null,null,null,null,null,null,null,null,null,{"$f":"Medewerkers!A52","v":" "}]
[null,null,null,null,null,null,null,null,null,null,null,null,null,null,null,null,null,null,null,null,null,null,null,null,null,null,null,{"$f":"Medewerkers!A53","v":" "}]
[null,null,null,null,null,null,null,null,null,null,null,null,null,null,null,null,null,null,null,null,null,null,null,null,null,null,null,{"$f":"Medewerkers!A54","v":" "}]
[null,null,null,null,null,null,null,null,null,null,null,null,null,null,null,null,null,null,null,null,null,null,null,null,null,null,null,{"$f":"Medewerkers!A55","v":" "}]
[null,null,null,null,null,null,null,null,null,null,null,null,null,null,null,null,null,null,null,null,null,null,null,null,null,null,null,{"$f":"Medewerkers!A56","v":" "}]
[null,null,null,null,null,null,null,null,null,null,null,null,null,null,null,null,null,null,null,null,null,null,null,null,null,null,null,{"$f":"Medewerkers!A57","v":" "}]
[null,null,null,null,null,null,null,null,null,null,null,null,null,null,null,null,null,null,null,null,null,null,null,null,null,null,null,{"$f":"Medewerkers!A58","v":" "}]
[null,null,null,null,null,null,null,null,null,null,null,null,null,null,null,null,null,null,null,null,null,null,null,null,null,null,null,{"$f":"Medewerkers!A59","v":" "}]
[null,null,null,null,null,null,null,null,null,null,null,null,null,null,null,null,null,null,null,null,null,null,null,null,null,null,null,{"$f":"Medewerkers!A60","v":" "}]
[null,null,null,null,null,null,null,null,null,null,null,null,null,null,null,null,null,null,null,null,null,null,null,null,null,null,null,{"$f":"Medewerkers!A61","v":" "}]
[null,null,null,null,null,null,null,null,null,null,null,null,null,null,null,null,null,null,null,null,null,null,null,null,null,null,null,{"$f":"Medewerkers!A62","v":" "}]
[null,null,null,null,null,null,null,null,null,null,null,null,null,null,null,null,null,null,null,null,null,null,null,null,null,null,null,{"$f":"Medewerkers!A63","v":" "}]
[null,null,null,null,null,null,null,null,null,null,null,null,null,null,null,null,null,null,null,null,null,null,null,null,null,null,null,{"$f":"Medewerkers!A64","v":" "}]
[null,null,null,null,null,null,null,null,null,null,null,null,null,null,null,null,null,null,null,null,null,null,null,null,null,null,null,{"$f":"Medewerkers!A65","v":" "}]
[null,null,null,null,null,null,null,null,null,null,null,null,null,null,null,null,null,null,null,null,null,null,null,null,null,null,null,{"$f":"Medewerkers!A66","v":" "}]
[null,null,null,null,null,null,null,null,null,null,null,null,null,null,null,null,null,null,null,null,null,null,null,null,null,null,null,{"$f":"Medewerkers!A67","v":" "}]
[null,null,null,null,null,null,null,null,null,null,null,null,null,null,null,null,null,null,null,null,null,null,null,null,null,null,null,{"$f":"Medewerkers!A68","v":" "}]
[null,null,null,null,null,null,null,null,null,null,null,null,null,null,null,null,null,null,null,null,null,null,null,null,null,null,null,{"$f":"Medewerkers!A69","v":" "}]
[null,null,null,null,null,null,null,null,null,null,null,null,null,null,null,null,null,null,null,null,null,null,null,null,null,null,null,{"$f":"Medewerkers!A70","v":" "}]
[null,null,null,null,null,null,null,null,null,null,null,null,null,null,null,null,null,null,null,null,null,null,null,null,null,null,null,{"$f":"Medewerkers!A71","v":" "}]
[null,null,null,null,null,null,null,null,null,null,null,null,null,null,null,null,null,null,null,null,null,null,null,null,null,null,null,{"$f":"Medewerkers!A72","v":" "}]
[null,null,null,null,null,null,null,null,null,null,null,null,null,null,null,null,null,null,null,null,null,null,null,null,null,null,null,{"$f":"Medewerkers!A73","v":" "}]
[null,null,null,null,null,null,null,null,null,null,null,null,null,null,null,null,null,null,null,null,null,null,null,null,null,null,null,{"$f":"Medewerkers!A74","v":" "}]
[null,null,null,null,null,null,null,null,null,null,null,null,null,null,null,null,null,null,null,null,null,null,null,null,null,null,null,{"$f":"Medewerkers!A75","v":" "}]
[null,null,null,null,null,null,null,null,null,null,null,null,null,null,null,null,null,null,null,null,null,null,null,null,null,null,null,{"$f":"Medewerkers!A76","v":" "}]
[null,null,null,null,null,null,null,null,null,null,null,null,null,null,null,null,null,null,null,null,null,null,null,null,null,null,null,{"$f":"Medewerkers!A77","v":" "}]
[null,null,null,null,null,null,null,null,null,null,null,null,null,null,null,null,null,null,null,null,null,null,null,null,null,null,null,{"$f":"Medewerkers!A78","v":" "}]
[null,null,null,null,null,null,null,null,null,null,null,null,null,null,null,null,null,null,null,null,null,null,null,null,null,null,null,{"$f":"Medewerkers!A79","v":" "}]
[null,null,null,null,null,null,null,null,null,null,null,null,null,null,null,null,null,null,null,null,null,null,null,null,null,null,null,{"$f":"Medewerkers!A80","v":" "}]
[null,null,null,null,null,null,null,null,null,null,null,null,null,null,null,null,null,null,null,null,null,null,null,null,null,null,null,{"$f":"Medewerkers!A81","v":" "}]
[null,null,null,null,null,null,null,null,null,null,null,null,null,null,null,null,null,null,null,null,null,null,null,null,null,null,null,{"$f":"Medewerkers!A82","v":" "}]
[null,null,null,null,null,null,null,null,null,null,null,null,null,null,null,null,null,null,null,null,null,null,null,null,null,null,null,{"$f":"Medewerkers!A83","v":" "}]
[null,null,null,null,null,null,null,null,null,null,null,null,null,null,null,null,null,null,null,null,null,null,null,null,null,null,null,{"$f":"Medewerkers!A84","v":" "}]
[null,null,null,null,null,null,null,null,null,null,null,null,null,null,null,null,null,null,null,null,null,null,null,null,null,null,null,{"$f":"Medewerkers!A85","v":" "}]
[null,null,null,null,null,null,null,null,null,null,null,null,null,null,null,null,null,null,null,null,null,null,null,null,null,null,null,{"$f":"Medewerkers!A86","v":" "}]
[null,null,null,null,null,null,null,null,null,null,null,null,null,null,null,null,null,null,null,null,null,null,null,null,null,null,null,{"$f":"Medewerkers!A87","v":" "}]
[null,null,null,null,null,null,null,null,null,null,null,null,null,null,null,null,null,null,null,null,null,null,null,null,null,null,null,{"$f":"Medewerkers!A88","v":" "}]
[null,null,null,null,null,null,null,null,null,null,null,null,null,null,null,null,null,null,null,null,null,null,null,null,null,null,null,{"$f":"Medewerkers!A89","v":" "}]
[null,null,null,null,null,null,null,null,null,null,null,null,null,null,null,null,null,null,null,null,null,null,null,null,null,null,null,{"$f":"Medewerkers!A90","v":" "}]
[null,null,null,null,null,null,null,null,null,null,null,null,null,null,null,null,null,null,null,null,null,null,null,null,null,null,null,{"$f":"Medewerkers!A91","v":" "}]
[null,null,null,null,null,null,null,null,null,null,null,null,null,null,null,null,null,null,null,null,null,null,null,null,null,null,null,{"$f":"Medewerkers!A92","v":" "}]
[null,null,null,null,null,null,null,null,null,null,null,null,null,null,null,null,null,null,null,null,null,null,null,null,null,null,null,{"$f":"Medewerkers!A93","v":" "}]
[null,null,null,null,null,null,null,null,null,null,null,null,null,null,null,null,null,null,null,null,null,null,null,null,null,null,null,{"$f":"Medewerkers!A94","v":" "}]
[null,null,null,null,null,null,null,null,null,null,null,null,null,null,null,null,null,null,null,null,null,null,null,null,null,null,null,{"$f":"Medewerkers!A95","v":" "}]
[null,null,null,null,null,null,null,null,null,null,null,null,null,null,null,null,null,null,null,null,null,null,null,null,null,null,null,{"$f":"Medewerkers!A96","v":" "}]
[null,null,null,null,null,null,null,null,null,null,null,null,null,null,null,null,null,null,null,null,null,null,null,null,null,null,null,{"$f":"Medewerkers!A97","v":" "}]
[null,null,null,null,null,null,null,null,null,null,null,null,null,null,null,null,null,null,null,null,null,null,null,null,null,null,null,{"$f":"Medewerkers!A98","v":" "}]
[null,null,null,null,null,null,null,null,null,null,null,null,null,null,null,null,null,null,null,null,null,null,null,null,null,null,null,{"$f":"Medewerkers!A99","v":" "}]
[null,null,null,null,null,null,null,null,null,null,null,null,null,null,null,null,null,null,null,null,null,null,null,null,null,null,null,{"$f":"Medewerkers!A100","v":" "}]
[null,null,null,null,null,null,null,null,null,null,null,null,null,null,null,null,null,null,null,null,null,null,null,null,null,null,null,{"$f":"Medewerkers!A101","v":" "}]
[null,null,null,null,null,null,null,null,null,null,null,null,null,null,null,null,null,null,null,null,null,null,null,null,null,null,null,{"$f":"Medewerkers!A102","v":" "}]
[null,null,null,null,null,null,null,null,null,null,null,null,null,null,null,null,null,null,null,null,null,null,null,null,null,null,null,{"$f":"Medewerkers!A103","v":" "}]
[null,null,null,null,null,null,null,null,null,null,null,null,null,null,null,null,null,null,null,null,null,null,null,null,null,null,null,{"$f":"Medewerkers!A104","v":" "}]
[null,null,null,null,null,null,null,null,null,null,null,null,null,null,null,null,null,null,null,null,null,null,null,null,null,null,null,{"$f":"Medewerkers!A105","v":" "}]
[null,null,null,null,null,null,null,null,null,null,null,null,null,null,null,null,null,null,null,null,null,null,null,null,null,null,null,{"$f":"Medewerkers!A106","v":" "}]
[null,null,null,null,null,null,null,null,null,null,null,null,null,null,null,null,null,null,null,null,null,null,null,null,null,null,null,{"$f":"Medewerkers!A107","v":" "}]
[null,null,null,null,null,null,null,null,null,null,null,null,null,null,null,null,null,null,null,null,null,null,null,null,null,null,null,{"$f":"Medewerkers!A108","v":" "}]
[null,null,null,null,null,null,null,null,null,null,null,null,null,null,null,null,null,null,null,null,null,null,null,null,null,null,null,{"$f":"Medewerkers!A109","v":" "}]
[null,null,null,null,null,null,null,null,null,null,null,null,null,null,null,null,null,null,null,null,null,null,null,null,null,null,null,{"$f":"Medewerkers!A110","v":" "}]
[null,null,null,null,null,null,null,null,null,null,null,null,null,null,null,null,null,null,null,null,null,null,null,null,null,null,null,{"$f":"Medewerkers!A111","v":" "}]
[null,null,null,null,null,null,null,null,null,null,null,null,null,null,null,null,null,null,null,null,null,null,null,null,null,null,null,{"$f":"Medewerkers!A112","v":" "}]
[null,null,null,null,null,null,null,null,null,null,null,null,null,null,null,null,null,null,null,null,null,null,null,null,null,null,null,{"$f":"Medewerkers!A113","v":" "}]
[null,null,null,null,null,null,null,null,null,null,null,null,null,null,null,null,null,null,null,null,null,null,null,null,null,null,null,{"$f":"Medewerkers!A114","v":" "}]
[null,null,null,null,null,null,null,null,null,null,null,null,null,null,null,null,null,null,null,null,null,null,null,null,null,null,null,{"$f":"Medewerkers!A115","v":" "}]
[null,null,null,null,null,null,null,null,null,null,null,null,null,null,null,null,null,null,null,null,null,null,null,null,null,null,null,{"$f":"Medewerkers!A116","v":" "}]
[null,null,null,null,null,null,null,null,null,null,null,null,null,null,null,null,null,null,null,null,null,null,null,null,null,null,null,{"$f":"Medewerkers!A117","v":" "}]
[null,null,null,null,null,null,null,null,null,null,null,null,null,null,null,null,null,null,null,null,null,null,null,null,null,null,null,{"$f":"Medewerkers!A118","v":" "}]
[null,null,null,null,null,null,null,null,null,null,null,null,null,null,null,null,null,null,null,null,null,null,null,null,null,null,null,{"$f":"Medewerkers!A119","v":" "}]
[null,null,null,null,null,null,null,null,null,null,null,null,null,null,null,null,null,null,null,null,null,null,null,null,null,null,null,{"$f":"Medewerkers!A120","v":" "}]
[null,null,null,null,null,null,null,null,null,null,null,null,null,null,null,null,null,null,null,null,null,null,null,null,null,null,null,{"$f":"Medewerkers!A121","v":" "}]
[null,null,null,null,null,null,null,null,null,null,null,null,null,null,null,null,null,null,null,null,null,null,null,null,null,null,null,{"$f":"Medewerkers!A122","v":" "}]
[null,null,null,null,null,null,null,null,null,null,null,null,null,null,null,null,null,null,null,null,null,null,null,null,null,null,null,{"$f":"Medewerkers!A123","v":" "}]
[null,null,null,null,null,null,null,null,null,null,null,null,null,null,null,null,null,null,null,null,null,null,null,null,null,null,null,{"$f":"Medewerkers!A124","v":" "}]
[null,null,null,null,null,null,null,null,null,null,null,null,null,null,null,null,null,null,null,null,null,null,null,null,null,null,null,{"$f":"Medewerkers!A125","v":" "}]
[null,null,null,null,null,null,null,null,null,null,null,null,null,null,null,null,null,null,null,null,null,null,null,null,null,null,null,{"$f":"Medewerkers!A126","v":" "}]
[null,null,null,null,null,null,null,null,null,null,null,null,null,null,null,null,null,null,null,null,null,null,null,null,null,null,null,{"$f":"Medewerkers!A127","v":" "}]
[null,null,null,null,null,null,null,null,null,null,null,null,null,null,null,null,null,null,null,null,null,null,null,null,null,null,null,{"$f":"Medewerkers!A128","v":" "}]
[null,null,null,null,null,null,null,null,null,null,null,null,null,null,null,null,null,null,null,null,null,null,null,null,null,null,null,{"$f":"Medewerkers!A129","v":" "}]
[null,null,null,null,null,null,null,null,null,null,null,null,null,null,null,null,null,null,null,null,null,null,null,null,null,null,null,{"$f":"Medewerkers!A130","v":" "}]
[null,null,null,null,null,null,null,null,null,null,null,null,null,null,null,null,null,null,null,null,null,null,null,null,null,null,null,{"$f":"Medewerkers!A131","v":" "}]
[null,null,null,null,null,null,null,null,null,null,null,null,null,null,null,null,null,null,null,null,null,null,null,null,null,null,null,{"$f":"Medewerkers!A132","v":" "}]
[null,null,null,null,null,null,null,null,null,null,null,null,null,null,null,null,null,null,null,null,null,null,null,null,null,null,null,{"$f":"Medewerkers!A133","v":" "}]
[null,null,null,null,null,null,null,null,null,null,null,null,null,null,null,null,null,null,null,null,null,null,null,null,null,null,null,{"$f":"Medewerkers!A134","v":" "}]
[null,null,null,null,null,null,null,null,null,null,null,null,null,null,null,null,null,null,null,null,null,null,null,null,null,null,null,{"$f":"Medewerkers!A135","v":" "}]
[null,null,null,null,null,null,null,null,null,null,null,null,null,null,null,null,null,null,null,null,null,null,null,null,null,null,null,{"$f":"Medewerkers!A136","v":" "}]
[null,null,null,null,null,null,null,null,null,null,null,null,null,null,null,null,null,null,null,null,null,null,null,null,null,null,null,{"$f":"Medewerkers!A137","v":" "}]
[null,null,null,null,null,null,null,null,null,null,null,null,null,null,null,null,null,null,null,null,null,null,null,null,null,null,null,{"$f":"Medewerkers!A138","v":" "}]
[null,null,null,null,null,null,null,null,null,null,null,null,null,null,null,null,null,null,null,null,null,null,null,null,null,null,null,{"$f":"Medewerkers!A139","v":" "}]
[null,null,null,null,null,null,null,null,null,null,null,null,null,null,null,null,null,null,null,null,null,null,null,null,null,null,null,{"$f":"Medewerkers!A140","v":" "}]
[null,null,null,null,null,null,null,null,null,null,null,null,null,null,null,null,null,null,null,null,null,null,null,null,null,null,null,{"$f":"Medewerkers!A141","v":" "}]
[null,null,null,null,null,null,null,null,null,null,null,null,null,null,null,null,null,null,null,null,null,null,null,null,null,null,null,{"$f":"Medewerkers!A142","v":" "}]
[null,null,null,null,null,null,null,null,null,null,null,null,null,null,null,null,null,null,null,null,null,null,null,null,null,null,null,{"$f":"Medewerkers!A143","v":" "}]
[null,null,null,null,null,null,null,null,null,null,null,null,null,null,null,null,null,null,null,null,null,null,null,null,null,null,null,{"$f":"Medewerkers!A144","v":" "}]
[null,null,null,null,null,null,null,null,null,null,null,null,null,null,null,null,null,null,null,null,null,null,null,null,null,null,null,{"$f":"Medewerkers!A145","v":" "}]
[null,null,null,null,null,null,null,null,null,null,null,null,null,null,null,null,null,null,null,null,null,null,null,null,null,null,null,{"$f":"Medewerkers!A146","v":" "}]
[null,null,null,null,null,null,null,null,null,null,null,null,null,null,null,null,null,null,null,null,null,null,null,null,null,null,null,{"$f":"Medewerkers!A147","v":" "}]
[null,null,null,null,null,null,null,null,null,null,null,null,null,null,null,null,null,null,null,null,null,null,null,null,null,null,null,{"$f":"Medewerkers!A148","v":" "}]
[null,null,null,null,null,null,null,null,null,null,null,null,null,null,null,null,null,null,null,null,null,null,null,null,null,null,null,{"$f":"Medewerkers!A149","v":" "}]
[null,null,null,null,null,null,null,null,null,null,null,null,null,null,null,null,null,null,null,null,null,null,null,null,null,null,null,{"$f":"Medewerkers!A150","v":" "}]
[null,null,null,null,null,null,null,null,null,null,null,null,null,null,null,null,null,null,null,null,null,null,null,null,null,null,null,{"$f":"Medewerkers!A151","v":" "}]
[null,null,null,null,null,null,null,null,null,null,null,null,null,null,null,null,null,null,null,null,null,null,null,null,null,null,null,{"$f":"Medewerkers!A152","v":" "}]
[null,null,null,null,null,null,null,null,null,null,null,null,null,null,null,null,null,null,null,null,null,null,null,null,null,null,null,{"$f":"Medewerkers!A153","v":" "}]
[null,null,null,null,null,null,null,null,null,null,null,null,null,null,null,null,null,null,null,null,null,null,null,null,null,null,null,{"$f":"Medewerkers!A154","v":" "}]
[null,null,null,null,null,null,null,null,null,null,null,null,null,null,null,null,null,null,null,null,null,null,null,null,null,null,null,{"$f":"Medewerkers!A155","v":" "}]
[null,null,null,null,null,null,null,null,null,null,null,null,null,null,null,null,null,null,null,null,null,null,null,null,null,null,null,{"$f":"Medewerkers!A156","v":" "}]
[null,null,null,null,null,null,null,null,null,null,null,null,null,null,null,null,null,null,null,null,null,null,null,null,null,null,null,{"$f":"Medewerkers!A157","v":" "}]
[null,null,null,null,null,null,null,null,null,null,null,null,null,null,null,null,null,null,null,null,null,null,null,null,null,null,null,{"$f":"Medewerkers!A158","v":" "}]
[null,null,null,null,null,null,null,null,null,null,null,null,null,null,null,null,null,null,null,null,null,null,null,null,null,null,null,{"$f":"Medewerkers!A159","v":" "}]
[null,null,null,null,null,null,null,null,null,null,null,null,null,null,null,null,null,null,null,null,null,null,null,null,null,null,null,{"$f":"Medewerkers!A160","v":" "}]
[null,null,null,null,null,null,null,null,null,null,null,null,null,null,null,null,null,null,null,null,null,null,null,null,null,null,null,{"$f":"Medewerkers!A161","v":" "}]
[null,null,null,null,null,null,null,null,null,null,null,null,null,null,null,null,null,null,null,null,null,null,null,null,null,null,null,{"$f":"Medewerkers!A162","v":" "}]
[null,null,null,null,null,null,null,null,null,null,null,null,null,null,null,null,null,null,null,null,null,null,null,null,null,null,null,{"$f":"Medewerkers!A163","v":" "}]
[null,null,null,null,null,null,null,null,null,null,null,null,null,null,null,null,null,null,null,null,null,null,null,null,null,null,null,{"$f":"Medewerkers!A164","v":" "}]
[null,null,null,null,null,null,null,null,null,null,null,null,null,null,null,null,null,null,null,null,null,null,null,null,null,null,null,{"$f":"Medewerkers!A165","v":" "}]
[null,null,null,null,null,null,null,null,null,null,null,null,null,null,null,null,null,null,null,null,null,null,null,null,null,null,null,{"$f":"Medewerkers!A166","v":" "}]
[null,null,null,null,null,null,null,null,null,null,null,null,null,null,null,null,null,null,null,null,null,null,null,null,null,null,null,{"$f":"Medewerkers!A167","v":" "}]
[null,null,null,null,null,null,null,null,null,null,null,null,null,null,null,null,null,null,null,null,null,null,null,null,null,null,null,{"$f":"Medewerkers!A168","v":" "}]
[null,null,null,null,null,null,null,null,null,null,null,null,null,null,null,null,null,null,null,null,null,null,null,null,null,null,null,{"$f":"Medewerkers!A169","v":" "}]
[null,null,null,null,null,null,null,null,null,null,null,null,null,null,null,null,null,null,null,null,null,null,null,null,null,null,null,{"$f":"Medewerkers!A170","v":" "}]
[null,null,null,null,null,null,null,null,null,null,null,null,null,null,null,null,null,null,null,null,null,null,null,null,null,null,null,{"$f":"Medewerkers!A171","v":" "}]
[null,null,null,null,null,null,null,null,null,null,null,null,null,null,null,null,null,null,null,null,null,null,null,null,null,null,null,{"$f":"Medewerkers!A172","v":" "}]
[null,null,null,null,null,null,null,null,null,null,null,null,null,null,null,null,null,null,null,null,null,null,null,null,null,null,null,{"$f":"Medewerkers!A173","v":" "}]
[null,null,null,null,null,null,null,null,null,null,null,null,null,null,null,null,null,null,null,null,null,null,null,null,null,null,null,{"$f":"Medewerkers!A174","v":" "}]
[null,null,null,null,null,null,null,null,null,null,null,null,null,null,null,null,null,null,null,null,null,null,null,null,null,null,null,{"$f":"Medewerkers!A175","v":" "}]
[null,null,null,null,null,null,null,null,null,null,null,null,null,null,null,null,null,null,null,null,null,null,null,null,null,null,null,{"$f":"Medewerkers!A176","v":" "}]
[null,null,null,null,null,null,null,null,null,null,null,null,null,null,null,null,null,null,null,null,null,null,null,null,null,null,null,{"$f":"Medewerkers!A177","v":" "}]
[null,null,null,null,null,null,null,null,null,null,null,null,null,null,null,null,null,null,null,null,null,null,null,null,null,null,null,{"$f":"Medewerkers!A178","v":" "}]
[null,null,null,null,null,null,null,null,null,null,null,null,null,null,null,null,null,null,null,null,null,null,null,null,null,null,null,{"$f":"Medewerkers!A179","v":" "}]
[null,null,null,null,null,null,null,null,null,null,null,null,null,null,null,null,null,null,null,null,null,null,null,null,null,null,null,{"$f":"Medewerkers!A180","v":" "}]
[null,null,null,null,null,null,null,null,null,null,null,null,null,null,null,null,null,null,null,null,null,null,null,null,null,null,null,{"$f":"Medewerkers!A181","v":" "}]
[null,null,null,null,null,null,null,null,null,null,null,null,null,null,null,null,null,null,null,null,null,null,null,null,null,null,null,{"$f":"Medewerkers!A182","v":" "}]
[null,null,null,null,null,null,null,null,null,null,null,null,null,null,null,null,null,null,null,null,null,null,null,null,null,null,null,{"$f":"Medewerkers!A183","v":" "}]
[null,null,null,null,null,null,null,null,null,null,null,null,null,null,null,null,null,null,null,null,null,null,null,null,null,null,null,{"$f":"Medewerkers!A184","v":" "}]
[null,null,null,null,null,null,null,null,null,null,null,null,null,null,null,null,null,null,null,null,null,null,null,null,null,null,null,{"$f":"Medewerkers!A185","v":" "}]
[null,null,null,null,null,null,null,null,null,null,null,null,null,null,null,null,null,null,null,null,null,null,null,null,null,null,null,{"$f":"Medewerkers!A186","v":" "}]
[null,null,null,null,null,null,null,null,null,null,null,null,null,null,null,null,null,null,null,null,null,null,null,null,null,null,null,{"$f":"Medewerkers!A187","v":" "}]
[null,null,null,null,null,null,null,null,null,null,null,null,null,null,null,null,null,null,null,null,null,null,null,null,null,null,null,{"$f":"Medewerkers!A188","v":" "}]
[null,null,null,null,null,null,null,null,null,null,null,null,null,null,null,null,null,null,null,null,null,null,null,null,null,null,null,{"$f":"Medewerkers!A189","v":" "}]
[null,null,null,null,null,null,null,null,null,null,null,null,null,null,null,null,null,null,null,null,null,null,null,null,null,null,null,{"$f":"Medewerkers!A190","v":" "}]
[null,null,null,null,null,null,null,null,null,null,null,null,null,null,null,null,null,null,null,null,null,null,null,null,null,null,null,{"$f":"Medewerkers!A191","v":" "}]
[null,null,null,null,null,null,null,null,null,null,null,null,null,null,null,null,null,null,null,null,null,null,null,null,null,null,null,{"$f":"Medewerkers!A192","v":" "}]
[null,null,null,null,null,null,null,null,null,null,null,null,null,null,null,null,null,null,null,null,null,null,null,null,null,null,null,{"$f":"Medewerkers!A193","v":" "}]
[null,null,null,null,null,null,null,null,null,null,null,null,null,null,null,null,null,null,null,null,null,null,null,null,null,null,null,{"$f":"Medewerkers!A194","v":" "}]
[null,null,null,null,null,null,null,null,null,null,null,null,null,null,null,null,null,null,null,null,null,null,null,null,null,null,null,{"$f":"Medewerkers!A195","v":" "}]
[null,null,null,null,null,null,null,null,null,null,null,null,null,null,null,null,null,null,null,null,null,null,null,null,null,null,null,{"$f":"Medewerkers!A196","v":" "}]
[null,null,null,null,null,null,null,null,null,null,null,null,null,null,null,null,null,null,null,null,null,null,null,null,null,null,null,{"$f":"Medewerkers!A197","v":" "}]
[null,null,null,null,null,null,null,null,null,null,null,null,null,null,null,null,null,null,null,null,null,null,null,null,null,null,null,{"$f":"Medewerkers!A198","v":" "}]
[null,null,null,null,null,null,null,null,null,null,null,null,null,null,null,null,null,null,null,null,null,null,null,null,null,null,null,{"$f":"Medewerkers!A199","v":" "}]
[null,null,null,null,null,null,null,null,null,null,null,null,null,null,null,null,null,null,null,null,null,null,null,null,null,null,null,{"$f":"Medewerkers!A200","v":" "}]
[null,null,null,null,null,null,null,null,null,null,null,null,null,null,null,null,null,null,null,null,null,null,null,null,null,null,null,{"$f":"Medewerkers!A201","v":" "}]
[null,null,null,null,null,null,null,null,null,null,null,null,null,null,null,null,null,null,null,null,null,null,null,null,null,null,null,{"$f":"Medewerkers!A202","v":" "}]
[null,null,null,null,null,null,null,null,null,null,null,null,null,null,null,null,null,null,null,null,null,null,null,null,null,null,null,{"$f":"Medewerkers!A203","v":" "}]
[null,null,null,null,null,null,null,null,null,null,null,null,null,null,null,null,null,null,null,null,null,null,null,null,null,null,null,{"$f":"Medewerkers!A204","v":" "}]
[null,null,null,null,null,null,null,null,null,null,null,null,null,null,null,null,null,null,null,null,null,null,null,null,null,null,null,{"$f":"Medewerkers!A205","v":" "}]
[null,null,null,null,null,null,null,null,null,null,null,null,null,null,null,null,null,null,null,null,null,null,null,null,null,null,null,{"$f":"Medewerkers!A206","v":" "}]
[null,null,null,null,null,null,null,null,null,null,null,null,null,null,null,null,null,null,null,null,null,null,null,null,null,null,null,{"$f":"Medewerkers!A207","v":" "}]
[null,null,null,null,null,null,null,null,null,null,null,null,null,null,null,null,null,null,null,null,null,null,null,null,null,null,null,{"$f":"Medewerkers!A208","v":" "}]
[null,null,null,null,null,null,null,null,null,null,null,null,null,null,null,null,null,null,null,null,null,null,null,null,null,null,null,{"$f":"Medewerkers!A209","v":" "}]
[null,null,null,null,null,null,null,null,null,null,null,null,null,null,null,null,null,null,null,null,null,null,null,null,null,null,null,{"$f":"Medewerkers!A210","v":" "}]
[null,null,null,null,null,null,null,null,null,null,null,null,null,null,null,null,null,null,null,null,null,null,null,null,null,null,null,{"$f":"Medewerkers!A211","v":" "}]
[null,null,null,null,null,null,null,null,null,null,null,null,null,null,null,null,null,null,null,null,null,null,null,null,null,null,null,{"$f":"Medewerkers!A212","v":" "}]
[null,null,null,null,null,null,null,null,null,null,null,null,null,null,null,null,null,null,null,null,null,null,null,null,null,null,null,{"$f":"Medewerkers!A213","v":" "}]
[null,null,null,null,null,null,null,null,null,null,null,null,null,null,null,null,null,null,null,null,null,null,null,null,null,null,null,{"$f":"Medewerkers!A214","v":" "}]
[null,null,null,null,null,null,null,null,null,null,null,null,null,null,null,null,null,null,null,null,null,null,null,null,null,null,null,{"$f":"Medewerkers!A215","v":" "}]
[null,null,null,null,null,null,null,null,null,null,null,null,null,null,null,null,null,null,null,null,null,null,null,null,null,null,null,{"$f":"Medewerkers!A216","v":" "}]
[null,null,null,null,null,null,null,null,null,null,null,null,null,null,null,null,null,null,null,null,null,null,null,null,null,null,null,{"$f":"Medewerkers!A217","v":" "}]
[null,null,null,null,null,null,null,null,null,null,null,null,null,null,null,null,null,null,null,null,null,null,null,null,null,null,null,{"$f":"Medewerkers!A218","v":" "}]
[null,null,null,null,null,null,null,null,null,null,null,null,null,null,null,null,null,null,null,null,null,null,null,null,null,null,null,{"$f":"Medewerkers!A219","v":" "}]
[null,null,null,null,null,null,null,null,null,null,null,null,null,null,null,null,null,null,null,null,null,null,null,null,null,null,null,{"$f":"Medewerkers!A220","v":" "}]
[null,null,null,null,null,null,null,null,null,null,null,null,null,null,null,null,null,null,null,null,null,null,null,null,null,null,null,{"$f":"Medewerkers!A221","v":" "}]
[null,null,null,null,null,null,null,null,null,null,null,null,null,null,null,null,null,null,null,null,null,null,null,null,null,null,null,{"$f":"Medewerkers!A222","v":" "}]
[null,null,null,null,null,null,null,null,null,null,null,null,null,null,null,null,null,null,null,null,null,null,null,null,null,null,null,{"$f":"Medewerkers!A223","v":" "}]
[null,null,null,null,null,null,null,null,null,null,null,null,null,null,null,null,null,null,null,null,null,null,null,null,null,null,null,{"$f":"Medewerkers!A224","v":" "}]
[null,null,null,null,null,null,null,null,null,null,null,null,null,null,null,null,null,null,null,null,null,null,null,null,null,null,null,{"$f":"Medewerkers!A225","v":" "}]
[null,null,null,null,null,null,null,null,null,null,null,null,null,null,null,null,null,null,null,null,null,null,null,null,null,null,null,{"$f":"Medewerkers!A226","v":" "}]
[null,null,null,null,null,null,null,null,null,null,null,null,null,null,null,null,null,null,null,null,null,null,null,null,null,null,null,{"$f":"Medewerkers!A227","v":" "}]
[null,null,null,null,null,null,null,null,null,null,null,null,null,null,null,null,null,null,null,null,null,null,null,null,null,null,null,{"$f":"Medewerkers!A228","v":" "}]
[null,null,null,null,null,null,null,null,null,null,null,null,null,null,null,null,null,null,null,null,null,null,null,null,null,null,null,{"$f":"Medewerkers!A229","v":" "}]
[null,null,null,null,null,null,null,null,null,null,null,null,null,null,null,null,null,null,null,null,null,null,null,null,null,null,null,{"$f":"Medewerkers!A230","v":" "}]
[null,null,null,null,null,null,null,null,null,null,null,null,null,null,null,null,null,null,null,null,null,null,null,null,null,null,null,{"$f":"Medewerkers!A231","v":" "}]
[null,null,null,null,null,null,null,null,null,null,null,null,null,null,null,null,null,null,null,null,null,null,null,null,null,null,null,{"$f":"Medewerkers!A232","v":" "}]
[null,null,null,null,null,null,null,null,null,null,null,null,null,null,null,null,null,null,null,null,null,null,null,null,null,null,null,{"$f":"Medewerkers!A233","v":" "}]
[null,null,null,null,null,null,null,null,null,null,null,null,null,null,null,null,null,null,null,null,null,null,null,null,null,null,null,{"$f":"Medewerkers!A234","v":" "}]
[null,null,null,null,null,null,null,null,null,null,null,null,null,null,null,null,null,null,null,null,null,null,null,null,null,null,null,{"$f":"Medewerkers!A235","v":" "}]
[null,null,null,null,null,null,null,null,null,null,null,null,null,null,null,null,null,null,null,null,null,null,null,null,null,null,null,{"$f":"Medewerkers!A236","v":" "}]
[null,null,null,null,null,null,null,null,null,null,null,null,null,null,null,null,null,null,null,null,null,null,null,null,null,null,null,{"$f":"Medewerkers!A237","v":" "}]
[null,null,null,null,null,null,null,null,null,null,null,null,null,null,null,null,null,null,null,null,null,null,null,null,null,null,null,{"$f":"Medewerkers!A238","v":" "}]
[null,null,null,null,null,null,null,null,null,null,null,null,null,null,null,null,null,null,null,null,null,null,null,null,null,null,null,{"$f":"Medewerkers!A239","v":" "}]
[null,null,null,null,null,null,null,null,null,null,null,null,null,null,null,null,null,null,null,null,null,null,null,null,null,null,null,{"$f":"Medewerkers!A240","v":" "}]
[null,null,null,null,null,null,null,null,null,null,null,null,null,null,null,null,null,null,null,null,null,null,null,null,null,null,null,{"$f":"Medewerkers!A241","v":" "}]
[null,null,null,null,null,null,null,null,null,null,null,null,null,null,null,null,null,null,null,null,null,null,null,null,null,null,null,{"$f":"Medewerkers!A242","v":" "}]
[null,null,null,null,null,null,null,null,null,null,null,null,null,null,null,null,null,null,null,null,null,null,null,null,null,null,null,{"$f":"Medewerkers!A243","v":" "}]
[null,null,null,null,null,null,null,null,null,null,null,null,null,null,null,null,null,null,null,null,null,null,null,null,null,null,null,{"$f":"Medewerkers!A244","v":" "}]
[null,null,null,null,null,null,null,null,null,null,null,null,null,null,null,null,null,null,null,null,null,null,null,null,null,null,null,{"$f":"Medewerkers!A245","v":" "}]
[null,null,null,null,null,null,null,null,null,null,null,null,null,null,null,null,null,null,null,null,null,null,null,null,null,null,null,{"$f":"Medewerkers!A246","v":" "}]
[null,null,null,null,null,null,null,null,null,null,null,null,null,null,null,null,null,null,null,null,null,null,null,null,null,null,null,{"$f":"Medewerkers!A247","v":" "}]
[null,null,null,null,null,null,null,null,null,null,null,null,null,null,null,null,null,null,null,null,null,null,null,null,null,null,null,{"$f":"Medewerkers!A248","v":" "}]
[null,null,null,null,null,null,null,null,null,null,null,null,null,null,null,null,null,null,null,null,null,null,null,null,null,null,null,{"$f":"Medewerkers!A249","v":" "}]
[null,null,null,null,null,null,null,null,null,null,null,null,null,null,null,null,null,null,null,null,null,null,null,null,null,null,null,{"$f":"Medewerkers!A250","v":" "}]
[null,null,null,null,null,null,null,null,null,null,null,null,null,null,null,null,null,null,null,null,null,null,null,null,null,null,null,{"$f":"Medewerkers!A251","v":" "}]