{"text_format":"1","workbook":"xlsx","n_sheets":6,"sheets":["Voorblad","Home","Project","Contentoverzicht","Acties","Lijsten"],"not_rendered":{"charts":0,"images":5,"macros":1,"external_links":0,"defined_names":4,"comments":0,"pivot_tables":0},"unopened":[],"bounds":{"document_bytes":16777216,"sheet_cells":100000,"rows_first":2000,"rows_last":500,"rows_between":2000,"halvings":0,"cell_chars":16384,"cell_head_chars":4096},"cells_cut":0,"cells_raw":0,"read":"whole","date_system":"1900"}

{"sheet":"Voorblad","index":0,"n_rows":34,"n_cols":6,"rows_kept":34,"cut":false,"hidden":false,"merged":[[6,1,6,5]]}
[]
[]
[]
[null,"Werkt de bovenstaande knop niet, dan moet je eerst de onderstaande stappen doorlopen om de macro's te deblokkeren."]
[]
[null,"Dit bestand bevat macro's"]
[null,"In nieuwere versies van Excel is door Microsoft een extra beveiliging geplaatst op het openen van bestanden met macro’s. \nNaast dat macro's erg nuttig kunnen zijn worden ze ook misbruikt voor malware en ransomware. Door de macro's standaard te blokkeren wil Microsoft de strijd aan gaan tegen cybercriminaliteit."]
[null,"Dit Exceldocument bevat macro's om een goede werking van het bestand te garanderen. Deblokkeren van het bestand doet u als volgt:"]
[]
[null,"Stap 1. Blokkade opheffen",null,null,"Stap 2. Macro's inschakelen"]
[null,"a.","U moet het bestand opslaan op een lokale harde schijf (of OneDrive). ",null,"Nadat je de blokkering van het Excelbestand hebt opgeheven, is het (vaak) ook nog nodig om de macro’s in te schakelen."]
[null,"b.","Open Windows Verkenner en zoek het bestand op. "]
[null,"c.","Klik vervolgens met de rechtermuisknop op het bestand en kies Eigenschappen in het contextmenu. \nOnderaan het tabblad Algemeen ziet u een sectie Beveiliging. Schakel het selectievakje Blokkering opheffen in. \n",null,"a.","Dit zie je doordat je een pop-up krijgt met de melding: ‘Microsoft Office heeft een mogelijk beveiligingsprobleem geïdentificeerd.’ of door een gele balk bovenin je Excelbestand met daarin de tekst: ‘BEVEILIGINGSWAARSCHUWING \nMacro’s zijn uitgeschakeld.’ Zie ook afbeeldingen 2 en 3."]
[null,null,"En klik op OK. Zie ook afbeelding 1",null,"b.","In deze gevallen kun je de macro’s inschakelen door op de knop ‘Macro’s inschakelen’ te klikken in het pop-up scherm, of \nop de knop ‘Inhoud inschakelen’ in de gele balk"]
[null,null,"Wanneer u nu het bestand (opnieuw) opent zullen de macro's in het bestand werkzaam zijn."]
[null,null,"Afbeelding 1",null,null,"Afbeelding 2                                                                                                    Afbeelding 3"]
[]
[]
[]
[]
[]
[]
[]
[]
[]
[]
[]
[]
[]
[]
[]
[]
[]
[null,"Deze handleiding is ook terug te lezen via deze link."]

{"sheet":"Home","index":1,"n_rows":10,"n_cols":20,"rows_kept":10,"cut":false,"hidden":false,"merged":[]}
[null,null,null,null,null,null,null,null,null,null,null,null,null,null,null,null,null,"Datum start"]
[null,null,{"$f":"TODAY()","v":"2026-01-06"},null,null,null,null,null,null,null,null,null,null,null,null,null,null,"Datum nu",{"$f":"TODAY()","v":"2026-01-06"}]
[null,null,{"$f":"C2-C1","v":46028},null,"Contentplanning",null,null,null,null,null,null,null,null,null,null,null,null,"Verschil",{"$f":"S2-S1","v":"2026-01-06"}]
[null,null,null,null,null,null,null,null,null,null,null,null,null,null,null,null,null,"Check 1"]
[null,null,null,null,null,null,null,null,null,null,null,null,null,null,null,null,null,"Check 2"]
[null,null,null,null,null,null,null,null,null,null,null,null,null,null,null,null,null,"Check 3"]
[null,null,null,null,null,null,null,null,null,null,null,null,null,null,null,null,null,"Check 4"]
[null,null,null,null,null,null,null,null,null,null,null,null,null,null,null,null,null,"Check 5"]
[null,null,null,null,null,null,null,null,null,null,null,null,null,null,null,null,"*","*",null,"info@terzake-excel.nl"]
[null,null,null,null,null,null,null,null,null,null,null,null,null,null,null,null,"(","(",null,"0317 200 009"]

{"sheet":"Project","index":2,"n_rows":3,"n_cols":5,"rows_kept":3,"cut":false,"hidden":false,"merged":[]}
[]
[]
["Project","Van datum","Tot datum","Omschrijving","Status"]

{"sheet":"Contentoverzicht","index":3,"n_rows":6,"n_cols":61,"rows_kept":6,"cut":false,"hidden":false,"merged":[[3,8,3,10],[3,11,3,13],[3,14,3,16],[3,17,3,19]]}
[null,null,{"$f":"COUNTIFS(Project!B:B,\">=\"&A4)","v":0},null,{"$f":"COUNTIFS(Acties!A:A,\">=\"&A4)","v":0}]
[]
["Vanaf datum"]
["2026-01-01",null,null,null,null,null,null,{"$f":"IF(Lijsten!$C$4=0,\"\",Lijsten!$C$4)","v":"opmeting"},{"$f":"IF(Lijsten!$C$5=0,\"\",Lijsten!$C$5)","v":"nt gepland"},null,null,{"$f":"IF(Lijsten!$C$6=0,\"\",Lijsten!$C$6)","v":"gepland"},null,null,{"$f":"IF(Lijsten!$C$7=0,\"\",Lijsten!$C$7)","v":"in uitvoering"},null,null,{"$f":"IF(Lijsten!$C$8=0,\"\",Lijsten!$C$8)","v":"uitgevoerd"}]
[null,null,null,null,null,null,null,null,{"$f":"A4","v":"2026-01-01"},{"$f":"I5+7","v":"2026-01-08"},{"$f":"J5+7","v":"2026-01-15"},"2026-01-22","2026-01-29","2026-02-05","2026-02-12","2026-02-19","2026-02-26","2026-03-05","2026-03-12","2026-03-19","2026-03-26","2026-04-02","2026-04-09","2026-04-16","2026-04-23","2026-04-30","2026-05-07","2026-05-14","2026-05-21","2026-05-28","2026-06-04","2026-06-11","2026-06-18","2026-06-25","2026-07-02","2026-07-09","2026-07-16","2026-07-23","2026-07-30","2026-08-06","2026-08-13","2026-08-20","2026-08-27","2026-09-03","2026-09-10","2026-09-17","2026-09-24","2026-10-01","2026-10-08","2026-10-15","2026-10-22","2026-10-29","2026-11-05","2026-11-12","2026-11-19","2026-11-26","2026-12-03","2026-12-10","2026-12-17","2026-12-24","2026-12-31"]
["Project","Actie","Datum","Van datum","Tot datum","Kanaal","Omschrijving","Status",{"$f":"A4","v":"2026-01-01"},{"$f":"I6+1","v":"2026-01-02"},{"$f":"J6+1","v":"2026-01-03"},"2026-01-04","2026-01-05","2026-01-06","2026-01-07","2026-01-08","2026-01-09","2026-01-10","2026-01-11","2026-01-12","2026-01-13","2026-01-14","2026-01-15","2026-01-16","2026-01-17","2026-01-18","2026-01-19","2026-01-20","2026-01-21","2026-01-22","2026-01-23","2026-01-24","2026-01-25","2026-01-26","2026-01-27","2026-01-28","2026-01-29","2026-01-30","2026-01-31",{"$f":"VLOOKUP(AN5,Lijsten!$G:$H,2,FALSE)","v":{"$error":"#N/A"}},{"$f":"VLOOKUP(AO5,Lijsten!$G:$H,2,FALSE)","v":{"$error":"#N/A"}},{"$f":"VLOOKUP(AP5,Lijsten!$G:$H,2,FALSE)","v":{"$error":"#N/A"}},{"$f":"VLOOKUP(AQ5,Lijsten!$G:$H,2,FALSE)","v":{"$error":"#N/A"}},{"$f":"VLOOKUP(AR5,Lijsten!$G:$H,2,FALSE)","v":{"$error":"#N/A"}},{"$f":"VLOOKUP(AS5,Lijsten!$G:$H,2,FALSE)","v":{"$error":"#N/A"}},{"$f":"VLOOKUP(AT5,Lijsten!$G:$H,2,FALSE)","v":{"$error":"#N/A"}},{"$f":"VLOOKUP(AU5,Lijsten!$G:$H,2,FALSE)","v":{"$error":"#N/A"}},{"$f":"VLOOKUP(AV5,Lijsten!$G:$H,2,FALSE)","v":{"$error":"#N/A"}},{"$f":"VLOOKUP(AW5,Lijsten!$G:$H,2,FALSE)","v":{"$error":"#N/A"}},{"$f":"VLOOKUP(AX5,Lijsten!$G:$H,2,FALSE)","v":{"$error":"#N/A"}},{"$f":"VLOOKUP(AY5,Lijsten!$G:$H,2,FALSE)","v":{"$error":"#N/A"}},{"$f":"VLOOKUP(AZ5,Lijsten!$G:$H,2,FALSE)","v":{"$error":"#N/A"}},{"$f":"VLOOKUP(BA5,Lijsten!$G:$H,2,FALSE)","v":{"$error":"#N/A"}},{"$f":"VLOOKUP(BB5,Lijsten!$G:$H,2,FALSE)","v":{"$error":"#N/A"}},{"$f":"VLOOKUP(BC5,Lijsten!$G:$H,2,FALSE)","v":{"$error":"#N/A"}},{"$f":"VLOOKUP(BD5,Lijsten!$G:$H,2,FALSE)","v":{"$error":"#N/A"}},{"$f":"VLOOKUP(BE5,Lijsten!$G:$H,2,FALSE)","v":{"$error":"#N/A"}},{"$f":"VLOOKUP(BF5,Lijsten!$G:$H,2,FALSE)","v":{"$error":"#N/A"}},{"$f":"VLOOKUP(BG5,Lijsten!$G:$H,2,FALSE)","v":{"$error":"#N/A"}},{"$f":"VLOOKUP(BH5,Lijsten!$G:$H,2,FALSE)","v":{"$error":"#N/A"}},{"$f":"VLOOKUP(BI5,Lijsten!$G:$H,2,FALSE)","v":{"$error":"#N/A"}}]

{"sheet":"Acties","index":4,"n_rows":2003,"n_cols":9,"rows_kept":2003,"cut":false,"hidden":false,"merged":[]}
[]
[]
["Datum","Dag","Maand","Jaar","Project","Actie","Kanaal","Omschrijving","Status"]
[]
[null,{"$f":"WEEKDAY(A5,2)","v":6},{"$f":"MONTH(A5)","v":1},{"$f":"YEAR(A5)","v":1900}]
[null,6,1,1900]
[null,6,1,1900]
[null,6,1,1900]
[null,6,1,1900]
[null,6,1,1900]
[null,6,1,1900]
[null,6,1,1900]
[null,6,1,1900]
[null,6,1,1900]
[null,6,1,1900]
[null,6,1,1900]
[null,6,1,1900]
[null,6,1,1900]
[null,6,1,1900]
[null,6,1,1900]
[null,6,1,1900]
[null,6,1,1900]
[null,6,1,1900]
[null,6,1,1900]
[null,6,1,1900]
[null,6,1,1900]
[null,6,1,1900]
[null,6,1,1900]
[null,6,1,1900]
[null,6,1,1900]
[null,6,1,1900]
[null,6,1,1900]
[null,6,1,1900]
[null,6,1,1900]
[null,6,1,1900]
[null,6,1,1900]
[null,6,1,1900]
[null,6,1,1900]
[null,6,1,1900]
[null,6,1,1900]
[null,6,1,1900]
[null,6,1,1900]
[null,6,1,1900]
[null,6,1,1900]
[null,6,1,1900]
[null,6,1,1900]
[null,6,1,1900]
[null,6,1,1900]
[null,6,1,1900]
[null,6,1,1900]
[null,6,1,1900]
[null,6,1,1900]
[null,6,1,1900]
[null,6,1,1900]
[null,6,1,1900]
[null,6,1,1900]
[null,6,1,1900]
[null,6,1,1900]
[null,6,1,1900]
[null,6,1,1900]
[null,6,1,1900]
[null,6,1,1900]
[null,6,1,1900]
[null,6,1,1900]
[null,6,1,1900]
[null,6,1,1900]
[null,6,1,1900]
[null,6,1,1900]
[null,{"$f":"WEEKDAY(A69,2)","v":6},{"$f":"MONTH(A69)","v":1},{"$f":"YEAR(A69)","v":1900}]
[null,6,1,1900]
[null,6,1,1900]
[null,6,1,1900]
[null,6,1,1900]
[null,6,1,1900]
[null,6,1,1900]
[null,6,1,1900]
[null,6,1,1900]
[null,6,1,1900]
[null,6,1,1900]
[null,6,1,1900]
[null,6,1,1900]
[null,6,1,1900]
[null,6,1,1900]
[null,6,1,1900]
[null,6,1,1900]
[null,6,1,1900]
[null,6,1,1900]
[null,6,1,1900]
[null,6,1,1900]
[null,6,1,1900]
[null,6,1,1900]
[null,6,1,1900]
[null,6,1,1900]
[null,6,1,1900]
[null,6,1,1900]
[null,6,1,1900]
[null,6,1,1900]
[null,6,1,1900]
[null,6,1,1900]
[null,6,1,1900]
[null,6,1,1900]
[null,6,1,1900]
[null,6,1,1900]
[null,6,1,1900]
[null,6,1,1900]
[null,6,1,1900]
[null,6,1,1900]
[null,6,1,1900]
[null,6,1,1900]
[null,6,1,1900]
[null,6,1,1900]
[null,6,1,1900]
[null,6,1,1900]
[null,6,1,1900]
[null,6,1,1900]
[null,6,1,1900]
[null,6,1,1900]
[null,6,1,1900]
[null,6,1,1900]
[null,6,1,1900]
[null,6,1,1900]
[null,6,1,1900]
[null,6,1,1900]
[null,6,1,1900]
[null,6,1,1900]
[null,6,1,1900]
[null,6,1,1900]
[null,6,1,1900]
[null,6,1,1900]
[null,6,1,1900]
[null,6,1,1900]
[null,6,1,1900]
[null,{"$f":"WEEKDAY(A133,2)","v":6},{"$f":"MONTH(A133)","v":1},{"$f":"YEAR(A133)","v":1900}]
[null,6,1,1900]
[null,6,1,1900]
[null,6,1,1900]
[null,6,1,1900]
[null,6,1,1900]
[null,6,1,1900]
[null,6,1,1900]
[null,6,1,1900]
[null,6,1,1900]
[null,6,1,1900]
[null,6,1,1900]
[null,6,1,1900]
[null,6,1,1900]
[null,6,1,1900]
[null,6,1,1900]
[null,6,1,1900]
[null,6,1,1900]
[null,6,1,1900]
[null,6,1,1900]
[null,6,1,1900]
[null,6,1,1900]
[null,6,1,1900]
[null,6,1,1900]
[null,6,1,1900]
[null,6,1,1900]
[null,6,1,1900]
[null,6,1,1900]
[null,6,1,1900]
[null,6,1,1900]
[null,6,1,1900]
[null,6,1,1900]
[null,6,1,1900]
[null,6,1,1900]
[null,6,1,1900]
[null,6,1,1900]
[null,6,1,1900]
[null,6,1,1900]
[null,6,1,1900]
[null,6,1,1900]
[null,6,1,1900]
[null,6,1,1900]
[null,6,1,1900]
[null,6,1,1900]
[null,6,1,1900]
[null,6,1,1900]
[null,6,1,1900]
[null,6,1,1900]
[null,6,1,1900]
[null,6,1,1900]
[null,6,1,1900]
[null,6,1,1900]
[null,6,1,1900]
[null,6,1,1900]
[null,6,1,1900]
[null,6,1,1900]
[null,6,1,1900]
[null,6,1,1900]
[null,6,1,1900]
[null,6,1,1900]
[null,6,1,1900]
[null,6,1,1900]
[null,6,1,1900]
[null,6,1,1900]
[null,{"$f":"WEEKDAY(A197,2)","v":6},{"$f":"MONTH(A197)","v":1},{"$f":"YEAR(A197)","v":1900}]
[null,6,1,1900]
[null,6,1,1900]
[null,6,1,1900]
[null,6,1,1900]
[null,6,1,1900]
[null,6,1,1900]
[null,6,1,1900]
[null,6,1,1900]
[null,6,1,1900]
[null,6,1,1900]
[null,6,1,1900]
[null,6,1,1900]
[null,6,1,1900]
[null,6,1,1900]
[null,6,1,1900]
[null,6,1,1900]
[null,6,1,1900]
[null,6,1,1900]
[null,6,1,1900]
[null,6,1,1900]
[null,6,1,1900]
[null,6,1,1900]
[null,6,1,1900]
[null,6,1,1900]
[null,6,1,1900]
[null,6,1,1900]
[null,6,1,1900]
[null,6,1,1900]
[null,6,1,1900]
[null,6,1,1900]
[null,6,1,1900]
[null,6,1,1900]
[null,6,1,1900]
[null,6,1,1900]
[null,6,1,1900]
[null,6,1,1900]
[null,6,1,1900]
[null,6,1,1900]
[null,6,1,1900]
[null,6,1,1900]
[null,6,1,1900]
[null,6,1,1900]
[null,6,1,1900]
[null,6,1,1900]
[null,6,1,1900]
[null,6,1,1900]
[null,6,1,1900]
[null,6,1,1900]
[null,6,1,1900]
[null,6,1,1900]
[null,6,1,1900]
[null,6,1,1900]
[null,6,1,1900]
[null,6,1,1900]
[null,6,1,1900]
[null,6,1,1900]
[null,6,1,1900]
[null,6,1,1900]
[null,6,1,1900]
[null,6,1,1900]
[null,6,1,1900]
[null,6,1,1900]
[null,6,1,1900]
[null,{"$f":"WEEKDAY(A261,2)","v":6},{"$f":"MONTH(A261)","v":1},{"$f":"YEAR(A261)","v":1900}]
[null,6,1,1900]
[null,6,1,1900]
[null,6,1,1900]
[null,6,1,1900]
[null,6,1,1900]
[null,6,1,1900]
[null,6,1,1900]
[null,6,1,1900]
[null,6,1,1900]
[null,6,1,1900]
[null,6,1,1900]
[null,6,1,1900]
[null,6,1,1900]
[null,6,1,1900]
[null,6,1,1900]
[null,6,1,1900]
[null,6,1,1900]
[null,6,1,1900]
[null,6,1,1900]
[null,6,1,1900]
[null,6,1,1900]
[null,6,1,1900]
[null,6,1,1900]
[null,6,1,1900]
[null,6,1,1900]
[null,6,1,1900]
[null,6,1,1900]
[null,6,1,1900]
[null,6,1,1900]
[null,6,1,1900]
[null,6,1,1900]
[null,6,1,1900]
[null,6,1,1900]
[null,6,1,1900]
[null,6,1,1900]
[null,6,1,1900]
[null,6,1,1900]
[null,6,1,1900]
[null,6,1,1900]
[null,6,1,1900]
[null,6,1,1900]
[null,6,1,1900]
[null,6,1,1900]
[null,6,1,1900]
[null,6,1,1900]
[null,6,1,1900]
[null,6,1,1900]
[null,6,1,1900]
[null,6,1,1900]
[null,6,1,1900]
[null,6,1,1900]
[null,6,1,1900]
[null,6,1,1900]
[null,6,1,1900]
[null,6,1,1900]
[null,6,1,1900]
[null,6,1,1900]
[null,6,1,1900]
[null,6,1,1900]
[null,6,1,1900]
[null,6,1,1900]
[null,6,1,1900]
[null,6,1,1900]
[null,{"$f":"WEEKDAY(A325,2)","v":6},{"$f":"MONTH(A325)","v":1},{"$f":"YEAR(A325)","v":1900}]
[null,6,1,1900]
[null,6,1,1900]
[null,6,1,1900]
[null,6,1,1900]
[null,6,1,1900]
[null,6,1,1900]
[null,6,1,1900]
[null,6,1,1900]
[null,6,1,1900]
[null,6,1,1900]
[null,6,1,1900]
[null,6,1,1900]
[null,6,1,1900]
[null,6,1,1900]
[null,6,1,1900]
[null,6,1,1900]
[null,6,1,1900]
[null,6,1,1900]
[null,6,1,1900]
[null,6,1,1900]
[null,6,1,1900]
[null,6,1,1900]
[null,6,1,1900]
[null,6,1,1900]
[null,6,1,1900]
[null,6,1,1900]
[null,6,1,1900]
[null,6,1,1900]
[null,6,1,1900]
[null,6,1,1900]
[null,6,1,1900]
[null,6,1,1900]
[null,6,1,1900]
[null,6,1,1900]
[null,6,1,1900]
[null,6,1,1900]
[null,6,1,1900]
[null,6,1,1900]
[null,6,1,1900]
[null,6,1,1900]
[null,6,1,1900]
[null,6,1,1900]
[null,6,1,1900]
[null,6,1,1900]
[null,6,1,1900]
[null,6,1,1900]
[null,6,1,1900]
[null,6,1,1900]
[null,6,1,1900]
[null,6,1,1900]
[null,6,1,1900]
[null,6,1,1900]
[null,6,1,1900]
[null,6,1,1900]
[null,6,1,1900]
[null,6,1,1900]
[null,6,1,1900]
[null,6,1,1900]
[null,6,1,1900]
[null,6,1,1900]
[null,6,1,1900]
[null,6,1,1900]
[null,6,1,1900]
[null,{"$f":"WEEKDAY(A389,2)","v":6},{"$f":"MONTH(A389)","v":1},{"$f":"YEAR(A389)","v":1900}]
[null,6,1,1900]
[null,6,1,1900]
[null,6,1,1900]
[null,6,1,1900]
[null,6,1,1900]
[null,6,1,1900]
[null,6,1,1900]
[null,6,1,1900]
[null,6,1,1900]
[null,6,1,1900]
[null,6,1,1900]
[null,6,1,1900]
[null,6,1,1900]
[null,6,1,1900]
[null,6,1,1900]
[null,6,1,1900]
[null,6,1,1900]
[null,6,1,1900]
[null,6,1,1900]
[null,6,1,1900]
[null,6,1,1900]
[null,6,1,1900]
[null,6,1,1900]
[null,6,1,1900]
[null,6,1,1900]
[null,6,1,1900]
[null,6,1,1900]
[null,6,1,1900]
[null,6,1,1900]
[null,6,1,1900]
[null,6,1,1900]
[null,6,1,1900]
[null,6,1,1900]
[null,6,1,1900]
[null,6,1,1900]
[null,6,1,1900]
[null,6,1,1900]
[null,6,1,1900]
[null,6,1,1900]
[null,6,1,1900]
[null,6,1,1900]
[null,6,1,1900]
[null,6,1,1900]
[null,6,1,1900]
[null,6,1,1900]
[null,6,1,1900]
[null,6,1,1900]
[null,6,1,1900]
[null,6,1,1900]
[null,6,1,1900]
[null,6,1,1900]
[null,6,1,1900]
[null,6,1,1900]
[null,6,1,1900]
[null,6,1,1900]
[null,6,1,1900]
[null,6,1,1900]
[null,6,1,1900]
[null,6,1,1900]
[null,6,1,1900]
[null,6,1,1900]
[null,6,1,1900]
[null,6,1,1900]
[null,{"$f":"WEEKDAY(A453,2)","v":6},{"$f":"MONTH(A453)","v":1},{"$f":"YEAR(A453)","v":1900}]
[null,6,1,1900]
[null,6,1,1900]
[null,6,1,1900]
[null,6,1,1900]
[null,6,1,1900]
[null,6,1,1900]
[null,6,1,1900]
[null,6,1,1900]
[null,6,1,1900]
[null,6,1,1900]
[null,6,1,1900]
[null,6,1,1900]
[null,6,1,1900]
[null,6,1,1900]
[null,6,1,1900]
[null,6,1,1900]
[null,6,1,1900]
[null,6,1,1900]
[null,6,1,1900]
[null,6,1,1900]
[null,6,1,1900]
[null,6,1,1900]
[null,6,1,1900]
[null,6,1,1900]
[null,6,1,1900]
[null,6,1,1900]
[null,6,1,1900]
[null,6,1,1900]
[null,6,1,1900]
[null,6,1,1900]
[null,6,1,1900]
[null,6,1,1900]
[null,6,1,1900]
[null,6,1,1900]
[null,6,1,1900]
[null,6,1,1900]
[null,6,1,1900]
[null,6,1,1900]
[null,6,1,1900]
[null,6,1,1900]
[null,6,1,1900]
[null,6,1,1900]
[null,6,1,1900]
[null,6,1,1900]
[null,6,1,1900]
[null,6,1,1900]
[null,6,1,1900]
[null,6,1,1900]
[null,6,1,1900]
[null,6,1,1900]
[null,6,1,1900]
[null,6,1,1900]
[null,6,1,1900]
[null,6,1,1900]
[null,6,1,1900]
[null,6,1,1900]
[null,6,1,1900]
[null,6,1,1900]
[null,6,1,1900]
[null,6,1,1900]
[null,6,1,1900]
[null,6,1,1900]
[null,6,1,1900]
[null,{"$f":"WEEKDAY(A517,2)","v":6},{"$f":"MONTH(A517)","v":1},{"$f":"YEAR(A517)","v":1900}]
[null,6,1,1900]
[null,6,1,1900]
[null,6,1,1900]
[null,6,1,1900]
[null,6,1,1900]
[null,6,1,1900]
[null,6,1,1900]
[null,6,1,1900]
[null,6,1,1900]
[null,6,1,1900]
[null,6,1,1900]
[null,6,1,1900]
[null,6,1,1900]
[null,6,1,1900]
[null,6,1,1900]
[null,6,1,1900]
[null,6,1,1900]
[null,6,1,1900]
[null,6,1,1900]
[null,6,1,1900]
[null,6,1,1900]
[null,6,1,1900]
[null,6,1,1900]
[null,6,1,1900]
[null,6,1,1900]
[null,6,1,1900]
[null,6,1,1900]
[null,6,1,1900]
[null,6,1,1900]
[null,6,1,1900]
[null,6,1,1900]
[null,6,1,1900]
[null,6,1,1900]
[null,6,1,1900]
[null,6,1,1900]
[null,6,1,1900]
[null,6,1,1900]
[null,6,1,1900]
[null,6,1,1900]
[null,6,1,1900]
[null,6,1,1900]
[null,6,1,1900]
[null,6,1,1900]
[null,6,1,1900]
[null,6,1,1900]
[null,6,1,1900]
[null,6,1,1900]
[null,6,1,1900]
[null,6,1,1900]
[null,6,1,1900]
[null,6,1,1900]
[null,6,1,1900]
[null,6,1,1900]
[null,6,1,1900]
[null,6,1,1900]
[null,6,1,1900]
[null,6,1,1900]
[null,6,1,1900]
[null,6,1,1900]
[null,6,1,1900]
[null,6,1,1900]
[null,6,1,1900]
[null,6,1,1900]
[null,{"$f":"WEEKDAY(A581,2)","v":6},{"$f":"MONTH(A581)","v":1},{"$f":"YEAR(A581)","v":1900}]
[null,6,1,1900]
[null,6,1,1900]
[null,6,1,1900]
[null,6,1,1900]
[null,6,1,1900]
[null,6,1,1900]
[null,6,1,1900]
[null,6,1,1900]
[null,6,1,1900]
[null,6,1,1900]
[null,6,1,1900]
[null,6,1,1900]
[null,6,1,1900]
[null,6,1,1900]
[null,6,1,1900]
[null,6,1,1900]
[null,6,1,1900]
[null,6,1,1900]
[null,6,1,1900]
[null,6,1,1900]
[null,6,1,1900]
[null,6,1,1900]
[null,6,1,1900]
[null,6,1,1900]
[null,6,1,1900]
[null,6,1,1900]
[null,6,1,1900]
[null,6,1,1900]
[null,6,1,1900]
[null,6,1,1900]
[null,6,1,1900]
[null,6,1,1900]
[null,6,1,1900]
[null,6,1,1900]
[null,6,1,1900]
[null,6,1,1900]
[null,6,1,1900]
[null,6,1,1900]
[null,6,1,1900]
[null,6,1,1900]
[null,6,1,1900]
[null,6,1,1900]
[null,6,1,1900]
[null,6,1,1900]
[null,6,1,1900]
[null,6,1,1900]
[null,6,1,1900]
[null,6,1,1900]
[null,6,1,1900]
[null,6,1,1900]
[null,6,1,1900]
[null,6,1,1900]
[null,6,1,1900]
[null,6,1,1900]
[null,6,1,1900]
[null,6,1,1900]
[null,6,1,1900]
[null,6,1,1900]
[null,6,1,1900]
[null,6,1,1900]
[null,6,1,1900]
[null,6,1,1900]
[null,6,1,1900]
[null,{"$f":"WEEKDAY(A645,2)","v":6},{"$f":"MONTH(A645)","v":1},{"$f":"YEAR(A645)","v":1900}]
[null,6,1,1900]
[null,6,1,1900]
[null,6,1,1900]
[null,6,1,1900]
[null,6,1,1900]
[null,6,1,1900]
[null,6,1,1900]
[null,6,1,1900]
[null,6,1,1900]
[null,6,1,1900]
[null,6,1,1900]
[null,6,1,1900]
[null,6,1,1900]
[null,6,1,1900]
[null,6,1,1900]
[null,6,1,1900]
[null,6,1,1900]
[null,6,1,1900]
[null,6,1,1900]
[null,6,1,1900]
[null,6,1,1900]
[null,6,1,1900]
[null,6,1,1900]
[null,6,1,1900]
[null,6,1,1900]
[null,6,1,1900]
[null,6,1,1900]
[null,6,1,1900]
[null,6,1,1900]
[null,6,1,1900]
[null,6,1,1900]
[null,6,1,1900]
[null,6,1,1900]
[null,6,1,1900]
[null,6,1,1900]
[null,6,1,1900]
[null,6,1,1900]
[null,6,1,1900]
[null,6,1,1900]
[null,6,1,1900]
[null,6,1,1900]
[null,6,1,1900]
[null,6,1,1900]
[null,6,1,1900]
[null,6,1,1900]
[null,6,1,1900]
[null,6,1,1900]
[null,6,1,1900]
[null,6,1,1900]
[null,6,1,1900]
[null,6,1,1900]
[null,6,1,1900]
[null,6,1,1900]
[null,6,1,1900]
[null,6,1,1900]
[null,6,1,1900]
[null,6,1,1900]
[null,6,1,1900]
[null,6,1,1900]
[null,6,1,1900]
[null,6,1,1900]
[null,6,1,1900]
[null,6,1,1900]
[null,{"$f":"WEEKDAY(A709,2)","v":6},{"$f":"MONTH(A709)","v":1},{"$f":"YEAR(A709)","v":1900}]
[null,6,1,1900]
[null,6,1,1900]
[null,6,1,1900]
[null,6,1,1900]
[null,6,1,1900]
[null,6,1,1900]
[null,6,1,1900]
[null,6,1,1900]
[null,6,1,1900]
[null,6,1,1900]
[null,6,1,1900]
[null,6,1,1900]
[null,6,1,1900]
[null,6,1,1900]
[null,6,1,1900]
[null,6,1,1900]
[null,6,1,1900]
[null,6,1,1900]
[null,6,1,1900]
[null,6,1,1900]
[null,6,1,1900]
[null,6,1,1900]
[null,6,1,1900]
[null,6,1,1900]
[null,6,1,1900]
[null,6,1,1900]
[null,6,1,1900]
[null,6,1,1900]
[null,6,1,1900]
[null,6,1,1900]
[null,6,1,1900]
[null,6,1,1900]
[null,6,1,1900]
[null,6,1,1900]
[null,6,1,1900]
[null,6,1,1900]
[null,6,1,1900]
[null,6,1,1900]
[null,6,1,1900]
[null,6,1,1900]
[null,6,1,1900]
[null,6,1,1900]
[null,6,1,1900]
[null,6,1,1900]
[null,6,1,1900]
[null,6,1,1900]
[null,6,1,1900]
[null,6,1,1900]
[null,6,1,1900]
[null,6,1,1900]
[null,6,1,1900]
[null,6,1,1900]
[null,6,1,1900]
[null,6,1,1900]
[null,6,1,1900]
[null,6,1,1900]
[null,6,1,1900]
[null,6,1,1900]
[null,6,1,1900]
[null,6,1,1900]
[null,6,1,1900]
[null,6,1,1900]
[null,6,1,1900]
[null,{"$f":"WEEKDAY(A773,2)","v":6},{"$f":"MONTH(A773)","v":1},{"$f":"YEAR(A773)","v":1900}]
[null,6,1,1900]
[null,6,1,1900]
[null,6,1,1900]
[null,6,1,1900]
[null,6,1,1900]
[null,6,1,1900]
[null,6,1,1900]
[null,6,1,1900]
[null,6,1,1900]
[null,6,1,1900]
[null,6,1,1900]
[null,6,1,1900]
[null,6,1,1900]
[null,6,1,1900]
[null,6,1,1900]
[null,6,1,1900]
[null,6,1,1900]
[null,6,1,1900]
[null,6,1,1900]
[null,6,1,1900]
[null,6,1,1900]
[null,6,1,1900]
[null,6,1,1900]
[null,6,1,1900]
[null,6,1,1900]
[null,6,1,1900]
[null,6,1,1900]
[null,6,1,1900]
[null,6,1,1900]
[null,6,1,1900]
[null,6,1,1900]
[null,6,1,1900]
[null,6,1,1900]
[null,6,1,1900]
[null,6,1,1900]
[null,6,1,1900]
[null,6,1,1900]
[null,6,1,1900]
[null,6,1,1900]
[null,6,1,1900]
[null,6,1,1900]
[null,6,1,1900]
[null,6,1,1900]
[null,6,1,1900]
[null,6,1,1900]
[null,6,1,1900]
[null,6,1,1900]
[null,6,1,1900]
[null,6,1,1900]
[null,6,1,1900]
[null,6,1,1900]
[null,6,1,1900]
[null,6,1,1900]
[null,6,1,1900]
[null,6,1,1900]
[null,6,1,1900]
[null,6,1,1900]
[null,6,1,1900]
[null,6,1,1900]
[null,6,1,1900]
[null,6,1,1900]
[null,6,1,1900]
[null,6,1,1900]
[null,{"$f":"WEEKDAY(A837,2)","v":6},{"$f":"MONTH(A837)","v":1},{"$f":"YEAR(A837)","v":1900}]
[null,6,1,1900]
[null,6,1,1900]
[null,6,1,1900]
[null,6,1,1900]
[null,6,1,1900]
[null,6,1,1900]
[null,6,1,1900]
[null,6,1,1900]
[null,6,1,1900]
[null,6,1,1900]
[null,6,1,1900]
[null,6,1,1900]
[null,6,1,1900]
[null,6,1,1900]
[null,6,1,1900]
[null,6,1,1900]
[null,6,1,1900]
[null,6,1,1900]
[null,6,1,1900]
[null,6,1,1900]
[null,6,1,1900]
[null,6,1,1900]
[null,6,1,1900]
[null,6,1,1900]
[null,6,1,1900]
[null,6,1,1900]
[null,6,1,1900]
[null,6,1,1900]
[null,6,1,1900]
[null,6,1,1900]
[null,6,1,1900]
[null,6,1,1900]
[null,6,1,1900]
[null,6,1,1900]
[null,6,1,1900]
[null,6,1,1900]
[null,6,1,1900]
[null,6,1,1900]
[null,6,1,1900]
[null,6,1,1900]
[null,6,1,1900]
[null,6,1,1900]
[null,6,1,1900]
[null,6,1,1900]
[null,6,1,1900]
[null,6,1,1900]
[null,6,1,1900]
[null,6,1,1900]
[null,6,1,1900]
[null,6,1,1900]
[null,6,1,1900]
[null,6,1,1900]
[null,6,1,1900]
[null,6,1,1900]
[null,6,1,1900]
[null,6,1,1900]
[null,6,1,1900]
[null,6,1,1900]
[null,6,1,1900]
[null,6,1,1900]
[null,6,1,1900]
[null,6,1,1900]
[null,6,1,1900]
[null,{"$f":"WEEKDAY(A901,2)","v":6},{"$f":"MONTH(A901)","v":1},{"$f":"YEAR(A901)","v":1900}]
[null,6,1,1900]
[null,6,1,1900]
[null,6,1,1900]
[null,6,1,1900]
[null,6,1,1900]
[null,6,1,1900]
[null,6,1,1900]
[null,6,1,1900]
[null,6,1,1900]
[null,6,1,1900]
[null,6,1,1900]
[null,6,1,1900]
[null,6,1,1900]
[null,6,1,1900]
[null,6,1,1900]
[null,6,1,1900]
[null,6,1,1900]
[null,6,1,1900]
[null,6,1,1900]
[null,6,1,1900]
[null,6,1,1900]
[null,6,1,1900]
[null,6,1,1900]
[null,6,1,1900]
[null,6,1,1900]
[null,6,1,1900]
[null,6,1,1900]
[null,6,1,1900]
[null,6,1,1900]
[null,6,1,1900]
[null,6,1,1900]
[null,6,1,1900]
[null,6,1,1900]
[null,6,1,1900]
[null,6,1,1900]
[null,6,1,1900]
[null,6,1,1900]
[null,6,1,1900]
[null,6,1,1900]
[null,6,1,1900]
[null,6,1,1900]
[null,6,1,1900]
[null,6,1,1900]
[null,6,1,1900]
[null,6,1,1900]
[null,6,1,1900]
[null,6,1,1900]
[null,6,1,1900]
[null,6,1,1900]
[null,6,1,1900]
[null,6,1,1900]
[null,6,1,1900]
[null,6,1,1900]
[null,6,1,1900]
[null,6,1,1900]
[null,6,1,1900]
[null,6,1,1900]
[null,6,1,1900]
[null,6,1,1900]
[null,6,1,1900]
[null,6,1,1900]
[null,6,1,1900]
[null,6,1,1900]
[null,{"$f":"WEEKDAY(A965,2)","v":6},{"$f":"MONTH(A965)","v":1},{"$f":"YEAR(A965)","v":1900}]
[null,6,1,1900]
[null,6,1,1900]
[null,6,1,1900]
[null,6,1,1900]
[null,6,1,1900]
[null,6,1,1900]
[null,6,1,1900]
[null,6,1,1900]
[null,6,1,1900]
[null,6,1,1900]
[null,6,1,1900]
[null,6,1,1900]
[null,6,1,1900]
[null,6,1,1900]
[null,6,1,1900]
[null,6,1,1900]
[null,6,1,1900]
[null,6,1,1900]
[null,6,1,1900]
[null,6,1,1900]
[null,6,1,1900]
[null,6,1,1900]
[null,6,1,1900]
[null,6,1,1900]
[null,6,1,1900]
[null,6,1,1900]
[null,6,1,1900]
[null,6,1,1900]
[null,6,1,1900]
[null,6,1,1900]
[null,6,1,1900]
[null,6,1,1900]
[null,6,1,1900]
[null,6,1,1900]
[null,6,1,1900]
[null,6,1,1900]
[null,6,1,1900]
[null,6,1,1900]
[null,6,1,1900]
[null,6,1,1900]
[null,6,1,1900]
[null,6,1,1900]
[null,6,1,1900]
[null,6,1,1900]
[null,6,1,1900]
[null,6,1,1900]
[null,6,1,1900]
[null,6,1,1900]
[null,6,1,1900]
[null,6,1,1900]
[null,6,1,1900]
[null,6,1,1900]
[null,6,1,1900]
[null,6,1,1900]
[null,6,1,1900]
[null,6,1,1900]
[null,6,1,1900]
[null,6,1,1900]
[null,6,1,1900]
[null,6,1,1900]
[null,6,1,1900]
[null,6,1,1900]
[null,6,1,1900]
[null,{"$f":"WEEKDAY(A1029,2)","v":6},{"$f":"MONTH(A1029)","v":1},{"$f":"YEAR(A1029)","v":1900}]
[null,6,1,1900]
[null,6,1,1900]
[null,6,1,1900]
[null,6,1,1900]
[null,6,1,1900]
[null,6,1,1900]
[null,6,1,1900]
[null,6,1,1900]
[null,6,1,1900]
[null,6,1,1900]
[null,6,1,1900]
[null,6,1,1900]
[null,6,1,1900]
[null,6,1,1900]
[null,6,1,1900]
[null,6,1,1900]
[null,6,1,1900]
[null,6,1,1900]
[null,6,1,1900]
[null,6,1,1900]
[null,6,1,1900]
[null,6,1,1900]
[null,6,1,1900]
[null,6,1,1900]
[null,6,1,1900]
[null,6,1,1900]
[null,6,1,1900]
[null,6,1,1900]
[null,6,1,1900]
[null,6,1,1900]
[null,6,1,1900]
[null,6,1,1900]
[null,6,1,1900]
[null,6,1,1900]
[null,6,1,1900]
[null,6,1,1900]
[null,6,1,1900]
[null,6,1,1900]
[null,6,1,1900]
[null,6,1,1900]
[null,6,1,1900]
[null,6,1,1900]
[null,6,1,1900]
[null,6,1,1900]
[null,6,1,1900]
[null,6,1,1900]
[null,6,1,1900]
[null,6,1,1900]
[null,6,1,1900]
[null,6,1,1900]
[null,6,1,1900]
[null,6,1,1900]
[null,6,1,1900]
[null,6,1,1900]
[null,6,1,1900]
[null,6,1,1900]
[null,6,1,1900]
[null,6,1,1900]
[null,6,1,1900]
[null,6,1,1900]
[null,6,1,1900]
[null,6,1,1900]
[null,6,1,1900]
[null,{"$f":"WEEKDAY(A1093,2)","v":6},{"$f":"MONTH(A1093)","v":1},{"$f":"YEAR(A1093)","v":1900}]
[null,6,1,1900]
[null,6,1,1900]
[null,6,1,1900]
[null,6,1,1900]
[null,6,1,1900]
[null,6,1,1900]
[null,6,1,1900]
[null,6,1,1900]
[null,6,1,1900]
[null,6,1,1900]
[null,6,1,1900]
[null,6,1,1900]
[null,6,1,1900]
[null,6,1,1900]
[null,6,1,1900]
[null,6,1,1900]
[null,6,1,1900]
[null,6,1,1900]
[null,6,1,1900]
[null,6,1,1900]
[null,6,1,1900]
[null,6,1,1900]
[null,6,1,1900]
[null,6,1,1900]
[null,6,1,1900]
[null,6,1,1900]
[null,6,1,1900]
[null,6,1,1900]
[null,6,1,1900]
[null,6,1,1900]
[null,6,1,1900]
[null,6,1,1900]
[null,6,1,1900]
[null,6,1,1900]
[null,6,1,1900]
[null,6,1,1900]
[null,6,1,1900]
[null,6,1,1900]
[null,6,1,1900]
[null,6,1,1900]
[null,6,1,1900]
[null,6,1,1900]
[null,6,1,1900]
[null,6,1,1900]
[null,6,1,1900]
[null,6,1,1900]
[null,6,1,1900]
[null,6,1,1900]
[null,6,1,1900]
[null,6,1,1900]
[null,6,1,1900]
[null,6,1,1900]
[null,6,1,1900]
[null,6,1,1900]
[null,6,1,1900]
[null,6,1,1900]
[null,6,1,1900]
[null,6,1,1900]
[null,6,1,1900]
[null,6,1,1900]
[null,6,1,1900]
[null,6,1,1900]
[null,6,1,1900]
[null,{"$f":"WEEKDAY(A1157,2)","v":6},{"$f":"MONTH(A1157)","v":1},{"$f":"YEAR(A1157)","v":1900}]
[null,6,1,1900]
[null,6,1,1900]
[null,6,1,1900]
[null,6,1,1900]
[null,6,1,1900]
[null,6,1,1900]
[null,6,1,1900]
[null,6,1,1900]
[null,6,1,1900]
[null,6,1,1900]
[null,6,1,1900]
[null,6,1,1900]
[null,6,1,1900]
[null,6,1,1900]
[null,6,1,1900]
[null,6,1,1900]
[null,6,1,1900]
[null,6,1,1900]
[null,6,1,1900]
[null,6,1,1900]
[null,6,1,1900]
[null,6,1,1900]
[null,6,1,1900]
[null,6,1,1900]
[null,6,1,1900]
[null,6,1,1900]
[null,6,1,1900]
[null,6,1,1900]
[null,6,1,1900]
[null,6,1,1900]
[null,6,1,1900]
[null,6,1,1900]
[null,6,1,1900]
[null,6,1,1900]
[null,6,1,1900]
[null,6,1,1900]
[null,6,1,1900]
[null,6,1,1900]
[null,6,1,1900]
[null,6,1,1900]
[null,6,1,1900]
[null,6,1,1900]
[null,6,1,1900]
[null,6,1,1900]
[null,6,1,1900]
[null,6,1,1900]
[null,6,1,1900]
[null,6,1,1900]
[null,6,1,1900]
[null,6,1,1900]
[null,6,1,1900]
[null,6,1,1900]
[null,6,1,1900]
[null,6,1,1900]
[null,6,1,1900]
[null,6,1,1900]
[null,6,1,1900]
[null,6,1,1900]
[null,6,1,1900]
[null,6,1,1900]
[null,6,1,1900]
[null,6,1,1900]
[null,6,1,1900]
[null,{"$f":"WEEKDAY(A1221,2)","v":6},{"$f":"MONTH(A1221)","v":1},{"$f":"YEAR(A1221)","v":1900}]
[null,6,1,1900]
[null,6,1,1900]
[null,6,1,1900]
[null,6,1,1900]
[null,6,1,1900]
[null,6,1,1900]
[null,6,1,1900]
[null,6,1,1900]
[null,6,1,1900]
[null,6,1,1900]
[null,6,1,1900]
[null,6,1,1900]
[null,6,1,1900]
[null,6,1,1900]
[null,6,1,1900]
[null,6,1,1900]
[null,6,1,1900]
[null,6,1,1900]
[null,6,1,1900]
[null,6,1,1900]
[null,6,1,1900]
[null,6,1,1900]
[null,6,1,1900]
[null,6,1,1900]
[null,6,1,1900]
[null,6,1,1900]
[null,6,1,1900]
[null,6,1,1900]
[null,6,1,1900]
[null,6,1,1900]
[null,6,1,1900]
[null,6,1,1900]
[null,6,1,1900]
[null,6,1,1900]
[null,6,1,1900]
[null,6,1,1900]
[null,6,1,1900]
[null,6,1,1900]
[null,6,1,1900]
[null,6,1,1900]
[null,6,1,1900]
[null,6,1,1900]
[null,6,1,1900]
[null,6,1,1900]
[null,6,1,1900]
[null,6,1,1900]
[null,6,1,1900]
[null,6,1,1900]
[null,6,1,1900]
[null,6,1,1900]
[null,6,1,1900]
[null,6,1,1900]
[null,6,1,1900]
[null,6,1,1900]
[null,6,1,1900]
[null,6,1,1900]
[null,6,1,1900]
[null,6,1,1900]
[null,6,1,1900]
[null,6,1,1900]
[null,6,1,1900]
[null,6,1,1900]
[null,6,1,1900]
[null,{"$f":"WEEKDAY(A1285,2)","v":6},{"$f":"MONTH(A1285)","v":1},{"$f":"YEAR(A1285)","v":1900}]
[null,6,1,1900]
[null,6,1,1900]
[null,6,1,1900]
[null,6,1,1900]
[null,6,1,1900]
[null,6,1,1900]
[null,6,1,1900]
[null,6,1,1900]
[null,6,1,1900]
[null,6,1,1900]
[null,6,1,1900]
[null,6,1,1900]
[null,6,1,1900]
[null,6,1,1900]
[null,6,1,1900]
[null,6,1,1900]
[null,6,1,1900]
[null,6,1,1900]
[null,6,1,1900]
[null,6,1,1900]
[null,6,1,1900]
[null,6,1,1900]
[null,6,1,1900]
[null,6,1,1900]
[null,6,1,1900]
[null,6,1,1900]
[null,6,1,1900]
[null,6,1,1900]
[null,6,1,1900]
[null,6,1,1900]
[null,6,1,1900]
[null,6,1,1900]
[null,6,1,1900]
[null,6,1,1900]
[null,6,1,1900]
[null,6,1,1900]
[null,6,1,1900]
[null,6,1,1900]
[null,6,1,1900]
[null,6,1,1900]
[null,6,1,1900]
[null,6,1,1900]
[null,6,1,1900]
[null,6,1,1900]
[null,6,1,1900]
[null,6,1,1900]
[null,6,1,1900]
[null,6,1,1900]
[null,6,1,1900]
[null,6,1,1900]
[null,6,1,1900]
[null,6,1,1900]
[null,6,1,1900]
[null,6,1,1900]
[null,6,1,1900]
[null,6,1,1900]
[null,6,1,1900]
[null,6,1,1900]
[null,6,1,1900]
[null,6,1,1900]
[null,6,1,1900]
[null,6,1,1900]
[null,6,1,1900]
[null,{"$f":"WEEKDAY(A1349,2)","v":6},{"$f":"MONTH(A1349)","v":1},{"$f":"YEAR(A1349)","v":1900}]
[null,6,1,1900]
[null,6,1,1900]
[null,6,1,1900]
[null,6,1,1900]
[null,6,1,1900]
[null,6,1,1900]
[null,6,1,1900]
[null,6,1,1900]
[null,6,1,1900]
[null,6,1,1900]
[null,6,1,1900]
[null,6,1,1900]
[null,6,1,1900]
[null,6,1,1900]
[null,6,1,1900]
[null,6,1,1900]
[null,6,1,1900]
[null,6,1,1900]
[null,6,1,1900]
[null,6,1,1900]
[null,6,1,1900]
[null,6,1,1900]
[null,6,1,1900]
[null,6,1,1900]
[null,6,1,1900]
[null,6,1,1900]
[null,6,1,1900]
[null,6,1,1900]
[null,6,1,1900]
[null,6,1,1900]
[null,6,1,1900]
[null,6,1,1900]
[null,6,1,1900]
[null,6,1,1900]
[null,6,1,1900]
[null,6,1,1900]
[null,6,1,1900]
[null,6,1,1900]
[null,6,1,1900]
[null,6,1,1900]
[null,6,1,1900]
[null,6,1,1900]
[null,6,1,1900]
[null,6,1,1900]
[null,6,1,1900]
[null,6,1,1900]
[null,6,1,1900]
[null,6,1,1900]
[null,6,1,1900]
[null,6,1,1900]
[null,6,1,1900]
[null,6,1,1900]
[null,6,1,1900]
[null,6,1,1900]
[null,6,1,1900]
[null,6,1,1900]
[null,6,1,1900]
[null,6,1,1900]
[null,6,1,1900]
[null,6,1,1900]
[null,6,1,1900]
[null,6,1,1900]
[null,6,1,1900]
[null,{"$f":"WEEKDAY(A1413,2)","v":6},{"$f":"MONTH(A1413)","v":1},{"$f":"YEAR(A1413)","v":1900}]
[null,6,1,1900]
[null,6,1,1900]
[null,6,1,1900]
[null,6,1,1900]
[null,6,1,1900]
[null,6,1,1900]
[null,6,1,1900]
[null,6,1,1900]
[null,6,1,1900]
[null,6,1,1900]
[null,6,1,1900]
[null,6,1,1900]
[null,6,1,1900]
[null,6,1,1900]
[null,6,1,1900]
[null,6,1,1900]
[null,6,1,1900]
[null,6,1,1900]
[null,6,1,1900]
[null,6,1,1900]
[null,6,1,1900]
[null,6,1,1900]
[null,6,1,1900]
[null,6,1,1900]
[null,6,1,1900]
[null,6,1,1900]
[null,6,1,1900]
[null,6,1,1900]
[null,6,1,1900]
[null,6,1,1900]
[null,6,1,1900]
[null,6,1,1900]
[null,6,1,1900]
[null,6,1,1900]
[null,6,1,1900]
[null,6,1,1900]
[null,6,1,1900]
[null,6,1,1900]
[null,6,1,1900]
[null,6,1,1900]
[null,6,1,1900]
[null,6,1,1900]
[null,6,1,1900]
[null,6,1,1900]
[null,6,1,1900]
[null,6,1,1900]
[null,6,1,1900]
[null,6,1,1900]
[null,6,1,1900]
[null,6,1,1900]
[null,6,1,1900]
[null,6,1,1900]
[null,6,1,1900]
[null,6,1,1900]
[null,6,1,1900]
[null,6,1,1900]
[null,6,1,1900]
[null,6,1,1900]
[null,6,1,1900]
[null,6,1,1900]
[null,6,1,1900]
[null,6,1,1900]
[null,6,1,1900]
[null,{"$f":"WEEKDAY(A1477,2)","v":6},{"$f":"MONTH(A1477)","v":1},{"$f":"YEAR(A1477)","v":1900}]
[null,6,1,1900]
[null,6,1,1900]
[null,6,1,1900]
[null,6,1,1900]
[null,6,1,1900]
[null,6,1,1900]
[null,6,1,1900]
[null,6,1,1900]
[null,6,1,1900]
[null,6,1,1900]
[null,6,1,1900]
[null,6,1,1900]
[null,6,1,1900]
[null,6,1,1900]
[null,6,1,1900]
[null,6,1,1900]
[null,6,1,1900]
[null,6,1,1900]
[null,6,1,1900]
[null,6,1,1900]
[null,6,1,1900]
[null,6,1,1900]
[null,6,1,1900]
[null,6,1,1900]
[null,6,1,1900]
[null,6,1,1900]
[null,6,1,1900]
[null,6,1,1900]
[null,6,1,1900]
[null,6,1,1900]
[null,6,1,1900]
[null,6,1,1900]
[null,6,1,1900]
[null,6,1,1900]
[null,6,1,1900]
[null,6,1,1900]
[null,6,1,1900]
[null,6,1,1900]
[null,6,1,1900]
[null,6,1,1900]
[null,6,1,1900]
[null,6,1,1900]
[null,6,1,1900]
[null,6,1,1900]
[null,6,1,1900]
[null,6,1,1900]
[null,6,1,1900]
[null,6,1,1900]
[null,6,1,1900]
[null,6,1,1900]
[null,6,1,1900]
[null,6,1,1900]
[null,6,1,1900]
[null,6,1,1900]
[null,6,1,1900]
[null,6,1,1900]
[null,6,1,1900]
[null,6,1,1900]
[null,6,1,1900]
[null,6,1,1900]
[null,6,1,1900]
[null,6,1,1900]
[null,6,1,1900]
[null,{"$f":"WEEKDAY(A1541,2)","v":6},{"$f":"MONTH(A1541)","v":1},{"$f":"YEAR(A1541)","v":1900}]
[null,6,1,1900]
[null,6,1,1900]
[null,6,1,1900]
[null,6,1,1900]
[null,6,1,1900]
[null,6,1,1900]
[null,6,1,1900]
[null,6,1,1900]
[null,6,1,1900]
[null,6,1,1900]
[null,6,1,1900]
[null,6,1,1900]
[null,6,1,1900]
[null,6,1,1900]
[null,6,1,1900]
[null,6,1,1900]
[null,6,1,1900]
[null,6,1,1900]
[null,6,1,1900]
[null,6,1,1900]
[null,6,1,1900]
[null,6,1,1900]
[null,6,1,1900]
[null,6,1,1900]
[null,6,1,1900]
[null,6,1,1900]
[null,6,1,1900]
[null,6,1,1900]
[null,6,1,1900]
[null,6,1,1900]
[null,6,1,1900]
[null,6,1,1900]
[null,6,1,1900]
[null,6,1,1900]
[null,6,1,1900]
[null,6,1,1900]
[null,6,1,1900]
[null,6,1,1900]
[null,6,1,1900]
[null,6,1,1900]
[null,6,1,1900]
[null,6,1,1900]
[null,6,1,1900]
[null,6,1,1900]
[null,6,1,1900]
[null,6,1,1900]
[null,6,1,1900]
[null,6,1,1900]
[null,6,1,1900]
[null,6,1,1900]
[null,6,1,1900]
[null,6,1,1900]
[null,6,1,1900]
[null,6,1,1900]
[null,6,1,1900]
[null,6,1,1900]
[null,6,1,1900]
[null,6,1,1900]
[null,6,1,1900]
[null,6,1,1900]
[null,6,1,1900]
[null,6,1,1900]
[null,6,1,1900]
[null,{"$f":"WEEKDAY(A1605,2)","v":6},{"$f":"MONTH(A1605)","v":1},{"$f":"YEAR(A1605)","v":1900}]
[null,6,1,1900]
[null,6,1,1900]
[null,6,1,1900]
[null,6,1,1900]
[null,6,1,1900]
[null,6,1,1900]
[null,6,1,1900]
[null,6,1,1900]
[null,6,1,1900]
[null,6,1,1900]
[null,6,1,1900]
[null,6,1,1900]
[null,6,1,1900]
[null,6,1,1900]
[null,6,1,1900]
[null,6,1,1900]
[null,6,1,1900]
[null,6,1,1900]
[null,6,1,1900]
[null,6,1,1900]
[null,6,1,1900]
[null,6,1,1900]
[null,6,1,1900]
[null,6,1,1900]
[null,6,1,1900]
[null,6,1,1900]
[null,6,1,1900]
[null,6,1,1900]
[null,6,1,1900]
[null,6,1,1900]
[null,6,1,1900]
[null,6,1,1900]
[null,6,1,1900]
[null,6,1,1900]
[null,6,1,1900]
[null,6,1,1900]
[null,6,1,1900]
[null,6,1,1900]
[null,6,1,1900]
[null,6,1,1900]
[null,6,1,1900]
[null,6,1,1900]
[null,6,1,1900]
[null,6,1,1900]
[null,6,1,1900]
[null,6,1,1900]
[null,6,1,1900]
[null,6,1,1900]
[null,6,1,1900]
[null,6,1,1900]
[null,6,1,1900]
[null,6,1,1900]
[null,6,1,1900]
[null,6,1,1900]
[null,6,1,1900]
[null,6,1,1900]
[null,6,1,1900]
[null,6,1,1900]
[null,6,1,1900]
[null,6,1,1900]
[null,6,1,1900]
[null,6,1,1900]
[null,6,1,1900]
[null,{"$f":"WEEKDAY(A1669,2)","v":6},{"$f":"MONTH(A1669)","v":1},{"$f":"YEAR(A1669)","v":1900}]
[null,6,1,1900]
[null,6,1,1900]
[null,6,1,1900]
[null,6,1,1900]
[null,6,1,1900]
[null,6,1,1900]
[null,6,1,1900]
[null,6,1,1900]
[null,6,1,1900]
[null,6,1,1900]
[null,6,1,1900]
[null,6,1,1900]
[null,6,1,1900]
[null,6,1,1900]
[null,6,1,1900]
[null,6,1,1900]
[null,6,1,1900]
[null,6,1,1900]
[null,6,1,1900]
[null,6,1,1900]
[null,6,1,1900]
[null,6,1,1900]
[null,6,1,1900]
[null,6,1,1900]
[null,6,1,1900]
[null,6,1,1900]
[null,6,1,1900]
[null,6,1,1900]
[null,6,1,1900]
[null,6,1,1900]
[null,6,1,1900]
[null,6,1,1900]
[null,6,1,1900]
[null,6,1,1900]
[null,6,1,1900]
[null,6,1,1900]
[null,6,1,1900]
[null,6,1,1900]
[null,6,1,1900]
[null,6,1,1900]
[null,6,1,1900]
[null,6,1,1900]
[null,6,1,1900]
[null,6,1,1900]
[null,6,1,1900]
[null,6,1,1900]
[null,6,1,1900]
[null,6,1,1900]
[null,6,1,1900]
[null,6,1,1900]
[null,6,1,1900]
[null,6,1,1900]
[null,6,1,1900]
[null,6,1,1900]
[null,6,1,1900]
[null,6,1,1900]
[null,6,1,1900]
[null,6,1,1900]
[null,6,1,1900]
[null,6,1,1900]
[null,6,1,1900]
[null,6,1,1900]
[null,6,1,1900]
[null,{"$f":"WEEKDAY(A1733,2)","v":6},{"$f":"MONTH(A1733)","v":1},{"$f":"YEAR(A1733)","v":1900}]
[null,6,1,1900]
[null,6,1,1900]
[null,6,1,1900]
[null,6,1,1900]
[null,6,1,1900]
[null,6,1,1900]
[null,6,1,1900]
[null,6,1,1900]
[null,6,1,1900]
[null,6,1,1900]
[null,6,1,1900]
[null,6,1,1900]
[null,6,1,1900]
[null,6,1,1900]
[null,6,1,1900]
[null,6,1,1900]
[null,6,1,1900]
[null,6,1,1900]
[null,6,1,1900]
[null,6,1,1900]
[null,6,1,1900]
[null,6,1,1900]
[null,6,1,1900]
[null,6,1,1900]
[null,6,1,1900]
[null,6,1,1900]
[null,6,1,1900]
[null,6,1,1900]
[null,6,1,1900]
[null,6,1,1900]
[null,6,1,1900]
[null,6,1,1900]
[null,6,1,1900]
[null,6,1,1900]
[null,6,1,1900]
[null,6,1,1900]
[null,6,1,1900]
[null,6,1,1900]
[null,6,1,1900]
[null,6,1,1900]
[null,6,1,1900]
[null,6,1,1900]
[null,6,1,1900]
[null,6,1,1900]
[null,6,1,1900]
[null,6,1,1900]
[null,6,1,1900]
[null,6,1,1900]
[null,6,1,1900]
[null,6,1,1900]
[null,6,1,1900]
[null,6,1,1900]
[null,6,1,1900]
[null,6,1,1900]
[null,6,1,1900]
[null,6,1,1900]
[null,6,1,1900]
[null,6,1,1900]
[null,6,1,1900]
[null,6,1,1900]
[null,6,1,1900]
[null,6,1,1900]
[null,6,1,1900]
[null,{"$f":"WEEKDAY(A1797,2)","v":6},{"$f":"MONTH(A1797)","v":1},{"$f":"YEAR(A1797)","v":1900}]
[null,6,1,1900]
[null,6,1,1900]
[null,6,1,1900]
[null,6,1,1900]
[null,6,1,1900]
[null,6,1,1900]
[null,6,1,1900]
[null,6,1,1900]
[null,6,1,1900]
[null,6,1,1900]
[null,6,1,1900]
[null,6,1,1900]
[null,6,1,1900]
[null,6,1,1900]
[null,6,1,1900]
[null,6,1,1900]
[null,6,1,1900]
[null,6,1,1900]
[null,6,1,1900]
[null,6,1,1900]
[null,6,1,1900]
[null,6,1,1900]
[null,6,1,1900]
[null,6,1,1900]
[null,6,1,1900]
[null,6,1,1900]
[null,6,1,1900]
[null,6,1,1900]
[null,6,1,1900]
[null,6,1,1900]
[null,6,1,1900]
[null,6,1,1900]
[null,6,1,1900]
[null,6,1,1900]
[null,6,1,1900]
[null,6,1,1900]
[null,6,1,1900]
[null,6,1,1900]
[null,6,1,1900]
[null,6,1,1900]
[null,6,1,1900]
[null,6,1,1900]
[null,6,1,1900]
[null,6,1,1900]
[null,6,1,1900]
[null,6,1,1900]
[null,6,1,1900]
[null,6,1,1900]
[null,6,1,1900]
[null,6,1,1900]
[null,6,1,1900]
[null,6,1,1900]
[null,6,1,1900]
[null,6,1,1900]
[null,6,1,1900]
[null,6,1,1900]
[null,6,1,1900]
[null,6,1,1900]
[null,6,1,1900]
[null,6,1,1900]
[null,6,1,1900]
[null,6,1,1900]
[null,6,1,1900]
[null,{"$f":"WEEKDAY(A1861,2)","v":6},{"$f":"MONTH(A1861)","v":1},{"$f":"YEAR(A1861)","v":1900}]
[null,6,1,1900]
[null,6,1,1900]
[null,6,1,1900]
[null,6,1,1900]
[null,6,1,1900]
[null,6,1,1900]
[null,6,1,1900]
[null,6,1,1900]
[null,6,1,1900]
[null,6,1,1900]
[null,6,1,1900]
[null,6,1,1900]
[null,6,1,1900]
[null,6,1,1900]
[null,6,1,1900]
[null,6,1,1900]
[null,6,1,1900]
[null,6,1,1900]
[null,6,1,1900]
[null,6,1,1900]
[null,6,1,1900]
[null,6,1,1900]
[null,6,1,1900]
[null,6,1,1900]
[null,6,1,1900]
[null,6,1,1900]
[null,6,1,1900]
[null,6,1,1900]
[null,6,1,1900]
[null,6,1,1900]
[null,6,1,1900]
[null,6,1,1900]
[null,6,1,1900]
[null,6,1,1900]
[null,6,1,1900]
[null,6,1,1900]
[null,6,1,1900]
[null,6,1,1900]
[null,6,1,1900]
[null,6,1,1900]
[null,6,1,1900]
[null,6,1,1900]
[null,6,1,1900]
[null,6,1,1900]
[null,6,1,1900]
[null,6,1,1900]
[null,6,1,1900]
[null,6,1,1900]
[null,6,1,1900]
[null,6,1,1900]
[null,6,1,1900]
[null,6,1,1900]
[null,6,1,1900]
[null,6,1,1900]
[null,6,1,1900]
[null,6,1,1900]
[null,6,1,1900]
[null,6,1,1900]
[null,6,1,1900]
[null,6,1,1900]
[null,6,1,1900]
[null,6,1,1900]
[null,6,1,1900]
[null,{"$f":"WEEKDAY(A1925,2)","v":6},{"$f":"MONTH(A1925)","v":1},{"$f":"YEAR(A1925)","v":1900}]
[null,6,1,1900]
[null,6,1,1900]
[null,6,1,1900]
[null,6,1,1900]
[null,6,1,1900]
[null,6,1,1900]
[null,6,1,1900]
[null,6,1,1900]
[null,6,1,1900]
[null,6,1,1900]
[null,6,1,1900]
[null,6,1,1900]
[null,6,1,1900]
[null,6,1,1900]
[null,6,1,1900]
[null,6,1,1900]
[null,6,1,1900]
[null,6,1,1900]
[null,6,1,1900]
[null,6,1,1900]
[null,6,1,1900]
[null,6,1,1900]
[null,6,1,1900]
[null,6,1,1900]
[null,6,1,1900]
[null,6,1,1900]
[null,6,1,1900]
[null,6,1,1900]
[null,6,1,1900]
[null,6,1,1900]
[null,6,1,1900]
[null,6,1,1900]
[null,6,1,1900]
[null,6,1,1900]
[null,6,1,1900]
[null,6,1,1900]
[null,6,1,1900]
[null,6,1,1900]
[null,6,1,1900]
[null,6,1,1900]
[null,6,1,1900]
[null,6,1,1900]
[null,6,1,1900]
[null,6,1,1900]
[null,6,1,1900]
[null,6,1,1900]
[null,6,1,1900]
[null,6,1,1900]
[null,6,1,1900]
[null,6,1,1900]
[null,6,1,1900]
[null,6,1,1900]
[null,6,1,1900]
[null,6,1,1900]
[null,6,1,1900]
[null,6,1,1900]
[null,6,1,1900]
[null,6,1,1900]
[null,6,1,1900]
[null,6,1,1900]
[null,6,1,1900]
[null,6,1,1900]
[null,6,1,1900]
[null,{"$f":"WEEKDAY(A1989,2)","v":6},{"$f":"MONTH(A1989)","v":1},{"$f":"YEAR(A1989)","v":1900}]
[null,6,1,1900]
[null,6,1,1900]
[null,6,1,1900]
[null,6,1,1900]
[null,6,1,1900]
[null,6,1,1900]
[null,6,1,1900]
[null,6,1,1900]
[null,6,1,1900]
[null,6,1,1900]
[null,6,1,1900]
[null,6,1,1900]
[null,6,1,1900]
[null,6,1,1900]

{"sheet":"Lijsten","index":5,"n_rows":3655,"n_cols":8,"rows_kept":3655,"cut":false,"hidden":false,"merged":[]}
[]
[]
["Kanalen",null,"Statussen",null,null,null,"2016-01-01",53]
["Enwbrief",null,"opmeting",null,null,null,"2016-01-02",53]
["Linkedin",null,"nt gepland",null,null,null,"2016-01-03",53]
["E-mail/Enquete",null,"gepland",null,null,null,"2016-01-04",1]
["Twitter",null,"in uitvoering",null,null,null,"2016-01-05",1]
[null,null,"uitgevoerd",null,null,null,"2016-01-06",1]
[null,null,null,null,null,null,"2016-01-07",1]
[null,null,null,null,null,null,"2016-01-08",1]
[null,null,null,null,null,null,"2016-01-09",1]
[null,null,null,null,null,null,"2016-01-10",1]
[null,null,null,null,null,null,"2016-01-11",2]
[null,null,null,null,null,null,"2016-01-12",2]
[null,null,null,null,null,null,"2016-01-13",2]
[null,null,null,null,null,null,"2016-01-14",2]
[null,null,null,null,null,null,"2016-01-15",2]
[null,null,null,null,null,null,"2016-01-16",2]
[null,null,null,null,null,null,"2016-01-17",2]
[null,null,null,null,null,null,"2016-01-18",3]
[null,null,null,null,null,null,"2016-01-19",3]
[null,null,null,null,null,null,"2016-01-20",3]
[null,null,null,null,null,null,"2016-01-21",3]
[null,null,null,null,null,null,"2016-01-22",3]
[null,null,null,null,null,null,"2016-01-23",3]
[null,null,null,null,null,null,"2016-01-24",3]
[null,null,null,null,null,null,"2016-01-25",4]
[null,null,null,null,null,null,"2016-01-26",4]
[null,null,null,null,null,null,"2016-01-27",4]
[null,null,null,null,null,null,"2016-01-28",4]
[null,null,null,null,null,null,"2016-01-29",4]
[null,null,null,null,null,null,"2016-01-30",4]
[null,null,null,null,null,null,"2016-01-31",4]
[null,null,null,null,null,null,"2016-02-01",5]
[null,null,null,null,null,null,"2016-02-02",5]
[null,null,null,null,null,null,"2016-02-03",5]
[null,null,null,null,null,null,"2016-02-04",5]
[null,null,null,null,null,null,"2016-02-05",5]
[null,null,null,null,null,null,"2016-02-06",5]
[null,null,null,null,null,null,"2016-02-07",5]
[null,null,null,null,null,null,"2016-02-08",6]
[null,null,null,null,null,null,"2016-02-09",6]
[null,null,null,null,null,null,"2016-02-10",6]
[null,null,null,null,null,null,"2016-02-11",6]
[null,null,null,null,null,null,"2016-02-12",6]
[null,null,null,null,null,null,"2016-02-13",6]
[null,null,null,null,null,null,"2016-02-14",6]
[null,null,null,null,null,null,"2016-02-15",7]
[null,null,null,null,null,null,"2016-02-16",7]
[null,null,null,null,null,null,"2016-02-17",7]
[null,null,null,null,null,null,"2016-02-18",7]
[null,null,null,null,null,null,"2016-02-19",7]
[null,null,null,null,null,null,"2016-02-20",7]
[null,null,null,null,null,null,"2016-02-21",7]
[null,null,null,null,null,null,"2016-02-22",8]
[null,null,null,null,null,null,"2016-02-23",8]
[null,null,null,null,null,null,"2016-02-24",8]
[null,null,null,null,null,null,"2016-02-25",8]
[null,null,null,null,null,null,"2016-02-26",8]
[null,null,null,null,null,null,"2016-02-27",8]
[null,null,null,null,null,null,"2016-02-28",8]
[null,null,null,null,null,null,"2016-02-29",9]
[null,null,null,null,null,null,"2016-03-01",9]
[null,null,null,null,null,null,"2016-03-02",9]
[null,null,null,null,null,null,"2016-03-03",9]
[null,null,null,null,null,null,"2016-03-04",9]
[null,null,null,null,null,null,"2016-03-05",9]
[null,null,null,null,null,null,"2016-03-06",9]
[null,null,null,null,null,null,"2016-03-07",10]
[null,null,null,null,null,null,"2016-03-08",10]
[null,null,null,null,null,null,"2016-03-09",10]
[null,null,null,null,null,null,"2016-03-10",10]
[null,null,null,null,null,null,"2016-03-11",10]
[null,null,null,null,null,null,"2016-03-12",10]
[null,null,null,null,null,null,"2016-03-13",10]
[null,null,null,null,null,null,"2016-03-14",11]
[null,null,null,null,null,null,"2016-03-15",11]
[null,null,null,null,null,null,"2016-03-16",11]
[null,null,null,null,null,null,"2016-03-17",11]
[null,null,null,null,null,null,"2016-03-18",11]
[null,null,null,null,null,null,"2016-03-19",11]
[null,null,null,null,null,null,"2016-03-20",11]
[null,null,null,null,null,null,"2016-03-21",12]
[null,null,null,null,null,null,"2016-03-22",12]
[null,null,null,null,null,null,"2016-03-23",12]
[null,null,null,null,null,null,"2016-03-24",12]
[null,null,null,null,null,null,"2016-03-25",12]
[null,null,null,null,null,null,"2016-03-26",12]
[null,null,null,null,null,null,"2016-03-27",12]
[null,null,null,null,null,null,"2016-03-28",13]
[null,null,null,null,null,null,"2016-03-29",13]
[null,null,null,null,null,null,"2016-03-30",13]
[null,null,null,null,null,null,"2016-03-31",13]
[null,null,null,null,null,null,"2016-04-01",13]
[null,null,null,null,null,null,"2016-04-02",13]
[null,null,null,null,null,null,"2016-04-03",13]
[null,null,null,null,null,null,"2016-04-04",14]
[null,null,null,null,null,null,"2016-04-05",14]
[null,null,null,null,null,null,"2016-04-06",14]
[null,null,null,null,null,null,"2016-04-07",14]
[null,null,null,null,null,null,"2016-04-08",14]
[null,null,null,null,null,null,"2016-04-09",14]
[null,null,null,null,null,null,"2016-04-10",14]
[null,null,null,null,null,null,"2016-04-11",15]
[null,null,null,null,null,null,"2016-04-12",15]
[null,null,null,null,null,null,"2016-04-13",15]
[null,null,null,null,null,null,"2016-04-14",15]
[null,null,null,null,null,null,"2016-04-15",15]
[null,null,null,null,null,null,"2016-04-16",15]
[null,null,null,null,null,null,"2016-04-17",15]
[null,null,null,null,null,null,"2016-04-18",16]
[null,null,null,null,null,null,"2016-04-19",16]
[null,null,null,null,null,null,"2016-04-20",16]
[null,null,null,null,null,null,"2016-04-21",16]
[null,null,null,null,null,null,"2016-04-22",16]
[null,null,null,null,null,null,"2016-04-23",16]
[null,null,null,null,null,null,"2016-04-24",16]
[null,null,null,null,null,null,"2016-04-25",17]
[null,null,null,null,null,null,"2016-04-26",17]
[null,null,null,null,null,null,"2016-04-27",17]
[null,null,null,null,null,null,"2016-04-28",17]
[null,null,null,null,null,null,"2016-04-29",17]
[null,null,null,null,null,null,"2016-04-30",17]
[null,null,null,null,null,null,"2016-05-01",17]
[null,null,null,null,null,null,"2016-05-02",18]
[null,null,null,null,null,null,"2016-05-03",18]
[null,null,null,null,null,null,"2016-05-04",18]
[null,null,null,null,null,null,"2016-05-05",18]
[null,null,null,null,null,null,"2016-05-06",18]
[null,null,null,null,null,null,"2016-05-07",18]
[null,null,null,null,null,null,"2016-05-08",18]
[null,null,null,null,null,null,"2016-05-09",19]
[null,null,null,null,null,null,"2016-05-10",19]
[null,null,null,null,null,null,"2016-05-11",19]
[null,null,null,null,null,null,"2016-05-12",19]
[null,null,null,null,null,null,"2016-05-13",19]
[null,null,null,null,null,null,"2016-05-14",19]
[null,null,null,null,null,null,"2016-05-15",19]
[null,null,null,null,null,null,"2016-05-16",20]
[null,null,null,null,null,null,"2016-05-17",20]
[null,null,null,null,null,null,"2016-05-18",20]
[null,null,null,null,null,null,"2016-05-19",20]
[null,null,null,null,null,null,"2016-05-20",20]
[null,null,null,null,null,null,"2016-05-21",20]
[null,null,null,null,null,null,"2016-05-22",20]
[null,null,null,null,null,null,"2016-05-23",21]
[null,null,null,null,null,null,"2016-05-24",21]
[null,null,null,null,null,null,"2016-05-25",21]
[null,null,null,null,null,null,"2016-05-26",21]
[null,null,null,null,null,null,"2016-05-27",21]
[null,null,null,null,null,null,"2016-05-28",21]
[null,null,null,null,null,null,"2016-05-29",21]
[null,null,null,null,null,null,"2016-05-30",22]
[null,null,null,null,null,null,"2016-05-31",22]
[null,null,null,null,null,null,"2016-06-01",22]
[null,null,null,null,null,null,"2016-06-02",22]
[null,null,null,null,null,null,"2016-06-03",22]
[null,null,null,null,null,null,"2016-06-04",22]
[null,null,null,null,null,null,"2016-06-05",22]
[null,null,null,null,null,null,"2016-06-06",23]
[null,null,null,null,null,null,"2016-06-07",23]
[null,null,null,null,null,null,"2016-06-08",23]
[null,null,null,null,null,null,"2016-06-09",23]
[null,null,null,null,null,null,"2016-06-10",23]
[null,null,null,null,null,null,"2016-06-11",23]
[null,null,null,null,null,null,"2016-06-12",23]
[null,null,null,null,null,null,"2016-06-13",24]
[null,null,null,null,null,null,"2016-06-14",24]
[null,null,null,null,null,null,"2016-06-15",24]
[null,null,null,null,null,null,"2016-06-16",24]
[null,null,null,null,null,null,"2016-06-17",24]
[null,null,null,null,null,null,"2016-06-18",24]
[null,null,null,null,null,null,"2016-06-19",24]
[null,null,null,null,null,null,"2016-06-20",25]
[null,null,null,null,null,null,"2016-06-21",25]
[null,null,null,null,null,null,"2016-06-22",25]
[null,null,null,null,null,null,"2016-06-23",25]
[null,null,null,null,null,null,"2016-06-24",25]
[null,null,null,null,null,null,"2016-06-25",25]
[null,null,null,null,null,null,"2016-06-26",25]
[null,null,null,null,null,null,"2016-06-27",26]
[null,null,null,null,null,null,"2016-06-28",26]
[null,null,null,null,null,null,"2016-06-29",26]
[null,null,null,null,null,null,"2016-06-30",26]
[null,null,null,null,null,null,"2016-07-01",26]
[null,null,null,null,null,null,"2016-07-02",26]
[null,null,null,null,null,null,"2016-07-03",26]
[null,null,null,null,null,null,"2016-07-04",27]
[null,null,null,null,null,null,"2016-07-05",27]
[null,null,null,null,null,null,"2016-07-06",27]
[null,null,null,null,null,null,"2016-07-07",27]
[null,null,null,null,null,null,"2016-07-08",27]
[null,null,null,null,null,null,"2016-07-09",27]
[null,null,null,null,null,null,"2016-07-10",27]
[null,null,null,null,null,null,"2016-07-11",28]
[null,null,null,null,null,null,"2016-07-12",28]
[null,null,null,null,null,null,"2016-07-13",28]
[null,null,null,null,null,null,"2016-07-14",28]
[null,null,null,null,null,null,"2016-07-15",28]
[null,null,null,null,null,null,"2016-07-16",28]
[null,null,null,null,null,null,"2016-07-17",28]
[null,null,null,null,null,null,"2016-07-18",29]
[null,null,null,null,null,null,"2016-07-19",29]
[null,null,null,null,null,null,"2016-07-20",29]
[null,null,null,null,null,null,"2016-07-21",29]
[null,null,null,null,null,null,"2016-07-22",29]
[null,null,null,null,null,null,"2016-07-23",29]
[null,null,null,null,null,null,"2016-07-24",29]
[null,null,null,null,null,null,"2016-07-25",30]
[null,null,null,null,null,null,"2016-07-26",30]
[null,null,null,null,null,null,"2016-07-27",30]
[null,null,null,null,null,null,"2016-07-28",30]
[null,null,null,null,null,null,"2016-07-29",30]
[null,null,null,null,null,null,"2016-07-30",30]
[null,null,null,null,null,null,"2016-07-31",30]
[null,null,null,null,null,null,"2016-08-01",31]
[null,null,null,null,null,null,"2016-08-02",31]
[null,null,null,null,null,null,"2016-08-03",31]
[null,null,null,null,null,null,"2016-08-04",31]
[null,null,null,null,null,null,"2016-08-05",31]
[null,null,null,null,null,null,"2016-08-06",31]
[null,null,null,null,null,null,"2016-08-07",31]
[null,null,null,null,null,null,"2016-08-08",32]
[null,null,null,null,null,null,"2016-08-09",32]
[null,null,null,null,null,null,"2016-08-10",32]
[null,null,null,null,null,null,"2016-08-11",32]
[null,null,null,null,null,null,"2016-08-12",32]
[null,null,null,null,null,null,"2016-08-13",32]
[null,null,null,null,null,null,"2016-08-14",32]
[null,null,null,null,null,null,"2016-08-15",33]
[null,null,null,null,null,null,"2016-08-16",33]
[null,null,null,null,null,null,"2016-08-17",33]
[null,null,null,null,null,null,"2016-08-18",33]
[null,null,null,null,null,null,"2016-08-19",33]
[null,null,null,null,null,null,"2016-08-20",33]
[null,null,null,null,null,null,"2016-08-21",33]
[null,null,null,null,null,null,"2016-08-22",34]
[null,null,null,null,null,null,"2016-08-23",34]
[null,null,null,null,null,null,"2016-08-24",34]
[null,null,null,null,null,null,"2016-08-25",34]
[null,null,null,null,null,null,"2016-08-26",34]
[null,null,null,null,null,null,"2016-08-27",34]
[null,null,null,null,null,null,"2016-08-28",34]
[null,null,null,null,null,null,"2016-08-29",35]
[null,null,null,null,null,null,"2016-08-30",35]
[null,null,null,null,null,null,"2016-08-31",35]
[null,null,null,null,null,null,"2016-09-01",35]
[null,null,null,null,null,null,"2016-09-02",35]
[null,null,null,null,null,null,"2016-09-03",35]
[null,null,null,null,null,null,"2016-09-04",35]
[null,null,null,null,null,null,"2016-09-05",36]
[null,null,null,null,null,null,"2016-09-06",36]
[null,null,null,null,null,null,"2016-09-07",36]
[null,null,null,null,null,null,"2016-09-08",36]
[null,null,null,null,null,null,"2016-09-09",36]
[null,null,null,null,null,null,"2016-09-10",36]
[null,null,null,null,null,null,"2016-09-11",36]
[null,null,null,null,null,null,"2016-09-12",37]
[null,null,null,null,null,null,"2016-09-13",37]
[null,null,null,null,null,null,"2016-09-14",37]
[null,null,null,null,null,null,"2016-09-15",37]
[null,null,null,null,null,null,"2016-09-16",37]
[null,null,null,null,null,null,"2016-09-17",37]
[null,null,null,null,null,null,"2016-09-18",37]
[null,null,null,null,null,null,"2016-09-19",38]
[null,null,null,null,null,null,"2016-09-20",38]
[null,null,null,null,null,null,"2016-09-21",38]
[null,null,null,null,null,null,"2016-09-22",38]
[null,null,null,null,null,null,"2016-09-23",38]
[null,null,null,null,null,null,"2016-09-24",38]
[null,null,null,null,null,null,"2016-09-25",38]
[null,null,null,null,null,null,"2016-09-26",39]
[null,null,null,null,null,null,"2016-09-27",39]
[null,null,null,null,null,null,"2016-09-28",39]
[null,null,null,null,null,null,"2016-09-29",39]
[null,null,null,null,null,null,"2016-09-30",39]
[null,null,null,null,null,null,"2016-10-01",39]
[null,null,null,null,null,null,"2016-10-02",39]
[null,null,null,null,null,null,"2016-10-03",40]
[null,null,null,null,null,null,"2016-10-04",40]
[null,null,null,null,null,null,"2016-10-05",40]
[null,null,null,null,null,null,"2016-10-06",40]
[null,null,null,null,null,null,"2016-10-07",40]
[null,null,null,null,null,null,"2016-10-08",40]
[null,null,null,null,null,null,"2016-10-09",40]
[null,null,null,null,null,null,"2016-10-10",41]
[null,null,null,null,null,null,"2016-10-11",41]
[null,null,null,null,null,null,"2016-10-12",41]
[null,null,null,null,null,null,"2016-10-13",41]
[null,null,null,null,null,null,"2016-10-14",41]
[null,null,null,null,null,null,"2016-10-15",41]
[null,null,null,null,null,null,"2016-10-16",41]
[null,null,null,null,null,null,"2016-10-17",42]
[null,null,null,null,null,null,"2016-10-18",42]
[null,null,null,null,null,null,"2016-10-19",42]
[null,null,null,null,null,null,"2016-10-20",42]
[null,null,null,null,null,null,"2016-10-21",42]
[null,null,null,null,null,null,"2016-10-22",42]
[null,null,null,null,null,null,"2016-10-23",42]
[null,null,null,null,null,null,"2016-10-24",43]
[null,null,null,null,null,null,"2016-10-25",43]
[null,null,null,null,null,null,"2016-10-26",43]
[null,null,null,null,null,null,"2016-10-27",43]
[null,null,null,null,null,null,"2016-10-28",43]
[null,null,null,null,null,null,"2016-10-29",43]
[null,null,null,null,null,null,"2016-10-30",43]
[null,null,null,null,null,null,"2016-10-31",44]
[null,null,null,null,null,null,"2016-11-01",44]
[null,null,null,null,null,null,"2016-11-02",44]
[null,null,null,null,null,null,"2016-11-03",44]
[null,null,null,null,null,null,"2016-11-04",44]
[null,null,null,null,null,null,"2016-11-05",44]
[null,null,null,null,null,null,"2016-11-06",44]
[null,null,null,null,null,null,"2016-11-07",45]
[null,null,null,null,null,null,"2016-11-08",45]
[null,null,null,null,null,null,"2016-11-09",45]
[null,null,null,null,null,null,"2016-11-10",45]
[null,null,null,null,null,null,"2016-11-11",45]
[null,null,null,null,null,null,"2016-11-12",45]
[null,null,null,null,null,null,"2016-11-13",45]
[null,null,null,null,null,null,"2016-11-14",46]
[null,null,null,null,null,null,"2016-11-15",46]
[null,null,null,null,null,null,"2016-11-16",46]
[null,null,null,null,null,null,"2016-11-17",46]
[null,null,null,null,null,null,"2016-11-18",46]
[null,null,null,null,null,null,"2016-11-19",46]
[null,null,null,null,null,null,"2016-11-20",46]
[null,null,null,null,null,null,"2016-11-21",47]
[null,null,null,null,null,null,"2016-11-22",47]
[null,null,null,null,null,null,"2016-11-23",47]
[null,null,null,null,null,null,"2016-11-24",47]
[null,null,null,null,null,null,"2016-11-25",47]
[null,null,null,null,null,null,"2016-11-26",47]
[null,null,null,null,null,null,"2016-11-27",47]
[null,null,null,null,null,null,"2016-11-28",48]
[null,null,null,null,null,null,"2016-11-29",48]
[null,null,null,null,null,null,"2016-11-30",48]
[null,null,null,null,null,null,"2016-12-01",48]
[null,null,null,null,null,null,"2016-12-02",48]
[null,null,null,null,null,null,"2016-12-03",48]
[null,null,null,null,null,null,"2016-12-04",48]
[null,null,null,null,null,null,"2016-12-05",49]
[null,null,null,null,null,null,"2016-12-06",49]
[null,null,null,null,null,null,"2016-12-07",49]
[null,null,null,null,null,null,"2016-12-08",49]
[null,null,null,null,null,null,"2016-12-09",49]
[null,null,null,null,null,null,"2016-12-10",49]
[null,null,null,null,null,null,"2016-12-11",49]
[null,null,null,null,null,null,"2016-12-12",50]
[null,null,null,null,null,null,"2016-12-13",50]
[null,null,null,null,null,null,"2016-12-14",50]
[null,null,null,null,null,null,"2016-12-15",50]
[null,null,null,null,null,null,"2016-12-16",50]
[null,null,null,null,null,null,"2016-12-17",50]
[null,null,null,null,null,null,"2016-12-18",50]
[null,null,null,null,null,null,"2016-12-19",51]
[null,null,null,null,null,null,"2016-12-20",51]
[null,null,null,null,null,null,"2016-12-21",51]
[null,null,null,null,null,null,"2016-12-22",51]
[null,null,null,null,null,null,"2016-12-23",51]
[null,null,null,null,null,null,"2016-12-24",51]
[null,null,null,null,null,null,"2016-12-25",51]
[null,null,null,null,null,null,"2016-12-26",52]
[null,null,null,null,null,null,"2016-12-27",52]
[null,null,null,null,null,null,"2016-12-28",52]
[null,null,null,null,null,null,"2016-12-29",52]
[null,null,null,null,null,null,"2016-12-30",52]
[null,null,null,null,null,null,"2016-12-31",52]
[null,null,null,null,null,null,"2017-01-01",52]
[null,null,null,null,null,null,"2017-01-02",1]
[null,null,null,null,null,null,"2017-01-03",1]
[null,null,null,null,null,null,"2017-01-04",1]
[null,null,null,null,null,null,"2017-01-05",1]
[null,null,null,null,null,null,"2017-01-06",1]
[null,null,null,null,null,null,"2017-01-07",1]
[null,null,null,null,null,null,"2017-01-08",1]
[null,null,null,null,null,null,"2017-01-09",2]
[null,null,null,null,null,null,"2017-01-10",2]
[null,null,null,null,null,null,"2017-01-11",2]
[null,null,null,null,null,null,"2017-01-12",2]
[null,null,null,null,null,null,"2017-01-13",2]
[null,null,null,null,null,null,"2017-01-14",2]
[null,null,null,null,null,null,"2017-01-15",2]
[null,null,null,null,null,null,"2017-01-16",3]
[null,null,null,null,null,null,"2017-01-17",3]
[null,null,null,null,null,null,"2017-01-18",3]
[null,null,null,null,null,null,"2017-01-19",3]
[null,null,null,null,null,null,"2017-01-20",3]
[null,null,null,null,null,null,"2017-01-21",3]
[null,null,null,null,null,null,"2017-01-22",3]
[null,null,null,null,null,null,"2017-01-23",4]
[null,null,null,null,null,null,"2017-01-24",4]
[null,null,null,null,null,null,"2017-01-25",4]
[null,null,null,null,null,null,"2017-01-26",4]
[null,null,null,null,null,null,"2017-01-27",4]
[null,null,null,null,null,null,"2017-01-28",4]
[null,null,null,null,null,null,"2017-01-29",4]
[null,null,null,null,null,null,"2017-01-30",5]
[null,null,null,null,null,null,"2017-01-31",5]
[null,null,null,null,null,null,"2017-02-01",5]
[null,null,null,null,null,null,"2017-02-02",5]
[null,null,null,null,null,null,"2017-02-03",5]
[null,null,null,null,null,null,"2017-02-04",5]
[null,null,null,null,null,null,"2017-02-05",5]
[null,null,null,null,null,null,"2017-02-06",6]
[null,null,null,null,null,null,"2017-02-07",6]
[null,null,null,null,null,null,"2017-02-08",6]
[null,null,null,null,null,null,"2017-02-09",6]
[null,null,null,null,null,null,"2017-02-10",6]
[null,null,null,null,null,null,"2017-02-11",6]
[null,null,null,null,null,null,"2017-02-12",6]
[null,null,null,null,null,null,"2017-02-13",7]
[null,null,null,null,null,null,"2017-02-14",7]
[null,null,null,null,null,null,"2017-02-15",7]
[null,null,null,null,null,null,"2017-02-16",7]
[null,null,null,null,null,null,"2017-02-17",7]
[null,null,null,null,null,null,"2017-02-18",7]
[null,null,null,null,null,null,"2017-02-19",7]
[null,null,null,null,null,null,"2017-02-20",8]
[null,null,null,null,null,null,"2017-02-21",8]
[null,null,null,null,null,null,"2017-02-22",8]
[null,null,null,null,null,null,"2017-02-23",8]
[null,null,null,null,null,null,"2017-02-24",8]
[null,null,null,null,null,null,"2017-02-25",8]
[null,null,null,null,null,null,"2017-02-26",8]
[null,null,null,null,null,null,"2017-02-27",9]
[null,null,null,null,null,null,"2017-02-28",9]
[null,null,null,null,null,null,"2017-03-01",9]
[null,null,null,null,null,null,"2017-03-02",9]
[null,null,null,null,null,null,"2017-03-03",9]
[null,null,null,null,null,null,"2017-03-04",9]
[null,null,null,null,null,null,"2017-03-05",9]
[null,null,null,null,null,null,"2017-03-06",10]
[null,null,null,null,null,null,"2017-03-07",10]
[null,null,null,null,null,null,"2017-03-08",10]
[null,null,null,null,null,null,"2017-03-09",10]
[null,null,null,null,null,null,"2017-03-10",10]
[null,null,null,null,null,null,"2017-03-11",10]
[null,null,null,null,null,null,"2017-03-12",10]
[null,null,null,null,null,null,"2017-03-13",11]
[null,null,null,null,null,null,"2017-03-14",11]
[null,null,null,null,null,null,"2017-03-15",11]
[null,null,null,null,null,null,"2017-03-16",11]
[null,null,null,null,null,null,"2017-03-17",11]
[null,null,null,null,null,null,"2017-03-18",11]
[null,null,null,null,null,null,"2017-03-19",11]
[null,null,null,null,null,null,"2017-03-20",12]
[null,null,null,null,null,null,"2017-03-21",12]
[null,null,null,null,null,null,"2017-03-22",12]
[null,null,null,null,null,null,"2017-03-23",12]
[null,null,null,null,null,null,"2017-03-24",12]
[null,null,null,null,null,null,"2017-03-25",12]
[null,null,null,null,null,null,"2017-03-26",12]
[null,null,null,null,null,null,"2017-03-27",13]
[null,null,null,null,null,null,"2017-03-28",13]
[null,null,null,null,null,null,"2017-03-29",13]
[null,null,null,null,null,null,"2017-03-30",13]
[null,null,null,null,null,null,"2017-03-31",13]
[null,null,null,null,null,null,"2017-04-01",13]
[null,null,null,null,null,null,"2017-04-02",13]
[null,null,null,null,null,null,"2017-04-03",14]
[null,null,null,null,null,null,"2017-04-04",14]
[null,null,null,null,null,null,"2017-04-05",14]
[null,null,null,null,null,null,"2017-04-06",14]
[null,null,null,null,null,null,"2017-04-07",14]
[null,null,null,null,null,null,"2017-04-08",14]
[null,null,null,null,null,null,"2017-04-09",14]
[null,null,null,null,null,null,"2017-04-10",15]
[null,null,null,null,null,null,"2017-04-11",15]
[null,null,null,null,null,null,"2017-04-12",15]
[null,null,null,null,null,null,"2017-04-13",15]
[null,null,null,null,null,null,"2017-04-14",15]
[null,null,null,null,null,null,"2017-04-15",15]
[null,null,null,null,null,null,"2017-04-16",15]
[null,null,null,null,null,null,"2017-04-17",16]
[null,null,null,null,null,null,"2017-04-18",16]
[null,null,null,null,null,null,"2017-04-19",16]
[null,null,null,null,null,null,"2017-04-20",16]
[null,null,null,null,null,null,"2017-04-21",16]
[null,null,null,null,null,null,"2017-04-22",16]
[null,null,null,null,null,null,"2017-04-23",16]
[null,null,null,null,null,null,"2017-04-24",17]
[null,null,null,null,null,null,"2017-04-25",17]
[null,null,null,null,null,null,"2017-04-26",17]
[null,null,null,null,null,null,"2017-04-27",17]
[null,null,null,null,null,null,"2017-04-28",17]
[null,null,null,null,null,null,"2017-04-29",17]
[null,null,null,null,null,null,"2017-04-30",17]
[null,null,null,null,null,null,"2017-05-01",18]
[null,null,null,null,null,null,"2017-05-02",18]
[null,null,null,null,null,null,"2017-05-03",18]
[null,null,null,null,null,null,"2017-05-04",18]
[null,null,null,null,null,null,"2017-05-05",18]
[null,null,null,null,null,null,"2017-05-06",18]
[null,null,null,null,null,null,"2017-05-07",18]
[null,null,null,null,null,null,"2017-05-08",19]
[null,null,null,null,null,null,"2017-05-09",19]
[null,null,null,null,null,null,"2017-05-10",19]
[null,null,null,null,null,null,"2017-05-11",19]
[null,null,null,null,null,null,"2017-05-12",19]
[null,null,null,null,null,null,"2017-05-13",19]
[null,null,null,null,null,null,"2017-05-14",19]
[null,null,null,null,null,null,"2017-05-15",20]
[null,null,null,null,null,null,"2017-05-16",20]
[null,null,null,null,null,null,"2017-05-17",20]
[null,null,null,null,null,null,"2017-05-18",20]
[null,null,null,null,null,null,"2017-05-19",20]
[null,null,null,null,null,null,"2017-05-20",20]
[null,null,null,null,null,null,"2017-05-21",20]
[null,null,null,null,null,null,"2017-05-22",21]
[null,null,null,null,null,null,"2017-05-23",21]
[null,null,null,null,null,null,"2017-05-24",21]
[null,null,null,null,null,null,"2017-05-25",21]
[null,null,null,null,null,null,"2017-05-26",21]
[null,null,null,null,null,null,"2017-05-27",21]
[null,null,null,null,null,null,"2017-05-28",21]
[null,null,null,null,null,null,"2017-05-29",22]
[null,null,null,null,null,null,"2017-05-30",22]
[null,null,null,null,null,null,"2017-05-31",22]
[null,null,null,null,null,null,"2017-06-01",22]
[null,null,null,null,null,null,"2017-06-02",22]
[null,null,null,null,null,null,"2017-06-03",22]
[null,null,null,null,null,null,"2017-06-04",22]
[null,null,null,null,null,null,"2017-06-05",23]
[null,null,null,null,null,null,"2017-06-06",23]
[null,null,null,null,null,null,"2017-06-07",23]
[null,null,null,null,null,null,"2017-06-08",23]
[null,null,null,null,null,null,"2017-06-09",23]
[null,null,null,null,null,null,"2017-06-10",23]
[null,null,null,null,null,null,"2017-06-11",23]
[null,null,null,null,null,null,"2017-06-12",24]
[null,null,null,null,null,null,"2017-06-13",24]
[null,null,null,null,null,null,"2017-06-14",24]
[null,null,null,null,null,null,"2017-06-15",24]
[null,null,null,null,null,null,"2017-06-16",24]
[null,null,null,null,null,null,"2017-06-17",24]
[null,null,null,null,null,null,"2017-06-18",24]
[null,null,null,null,null,null,"2017-06-19",25]
[null,null,null,null,null,null,"2017-06-20",25]
[null,null,null,null,null,null,"2017-06-21",25]
[null,null,null,null,null,null,"2017-06-22",25]
[null,null,null,null,null,null,"2017-06-23",25]
[null,null,null,null,null,null,"2017-06-24",25]
[null,null,null,null,null,null,"2017-06-25",25]
[null,null,null,null,null,null,"2017-06-26",26]
[null,null,null,null,null,null,"2017-06-27",26]
[null,null,null,null,null,null,"2017-06-28",26]
[null,null,null,null,null,null,"2017-06-29",26]
[null,null,null,null,null,null,"2017-06-30",26]
[null,null,null,null,null,null,"2017-07-01",26]
[null,null,null,null,null,null,"2017-07-02",26]
[null,null,null,null,null,null,"2017-07-03",27]
[null,null,null,null,null,null,"2017-07-04",27]
[null,null,null,null,null,null,"2017-07-05",27]
[null,null,null,null,null,null,"2017-07-06",27]
[null,null,null,null,null,null,"2017-07-07",27]
[null,null,null,null,null,null,"2017-07-08",27]
[null,null,null,null,null,null,"2017-07-09",27]
[null,null,null,null,null,null,"2017-07-10",28]
[null,null,null,null,null,null,"2017-07-11",28]
[null,null,null,null,null,null,"2017-07-12",28]
[null,null,null,null,null,null,"2017-07-13",28]
[null,null,null,null,null,null,"2017-07-14",28]
[null,null,null,null,null,null,"2017-07-15",28]
[null,null,null,null,null,null,"2017-07-16",28]
[null,null,null,null,null,null,"2017-07-17",29]
[null,null,null,null,null,null,"2017-07-18",29]
[null,null,null,null,null,null,"2017-07-19",29]
[null,null,null,null,null,null,"2017-07-20",29]
[null,null,null,null,null,null,"2017-07-21",29]
[null,null,null,null,null,null,"2017-07-22",29]
[null,null,null,null,null,null,"2017-07-23",29]
[null,null,null,null,null,null,"2017-07-24",30]
[null,null,null,null,null,null,"2017-07-25",30]
[null,null,null,null,null,null,"2017-07-26",30]
[null,null,null,null,null,null,"2017-07-27",30]
[null,null,null,null,null,null,"2017-07-28",30]
[null,null,null,null,null,null,"2017-07-29",30]
[null,null,null,null,null,null,"2017-07-30",30]
[null,null,null,null,null,null,"2017-07-31",31]
[null,null,null,null,null,null,"2017-08-01",31]
[null,null,null,null,null,null,"2017-08-02",31]
[null,null,null,null,null,null,"2017-08-03",31]
[null,null,null,null,null,null,"2017-08-04",31]
[null,null,null,null,null,null,"2017-08-05",31]
[null,null,null,null,null,null,"2017-08-06",31]
[null,null,null,null,null,null,"2017-08-07",32]
[null,null,null,null,null,null,"2017-08-08",32]
[null,null,null,null,null,null,"2017-08-09",32]
[null,null,null,null,null,null,"2017-08-10",32]
[null,null,null,null,null,null,"2017-08-11",32]
[null,null,null,null,null,null,"2017-08-12",32]
[null,null,null,null,null,null,"2017-08-13",32]
[null,null,null,null,null,null,"2017-08-14",33]
[null,null,null,null,null,null,"2017-08-15",33]
[null,null,null,null,null,null,"2017-08-16",33]
[null,null,null,null,null,null,"2017-08-17",33]
[null,null,null,null,null,null,"2017-08-18",33]
[null,null,null,null,null,null,"2017-08-19",33]
[null,null,null,null,null,null,"2017-08-20",33]
[null,null,null,null,null,null,"2017-08-21",34]
[null,null,null,null,null,null,"2017-08-22",34]
[null,null,null,null,null,null,"2017-08-23",34]
[null,null,null,null,null,null,"2017-08-24",34]
[null,null,null,null,null,null,"2017-08-25",34]
[null,null,null,null,null,null,"2017-08-26",34]
[null,null,null,null,null,null,"2017-08-27",34]
[null,null,null,null,null,null,"2017-08-28",35]
[null,null,null,null,null,null,"2017-08-29",35]
[null,null,null,null,null,null,"2017-08-30",35]
[null,null,null,null,null,null,"2017-08-31",35]
[null,null,null,null,null,null,"2017-09-01",35]
[null,null,null,null,null,null,"2017-09-02",35]
[null,null,null,null,null,null,"2017-09-03",35]
[null,null,null,null,null,null,"2017-09-04",36]
[null,null,null,null,null,null,"2017-09-05",36]
[null,null,null,null,null,null,"2017-09-06",36]
[null,null,null,null,null,null,"2017-09-07",36]
[null,null,null,null,null,null,"2017-09-08",36]
[null,null,null,null,null,null,"2017-09-09",36]
[null,null,null,null,null,null,"2017-09-10",36]
[null,null,null,null,null,null,"2017-09-11",37]
[null,null,null,null,null,null,"2017-09-12",37]
[null,null,null,null,null,null,"2017-09-13",37]
[null,null,null,null,null,null,"2017-09-14",37]
[null,null,null,null,null,null,"2017-09-15",37]
[null,null,null,null,null,null,"2017-09-16",37]
[null,null,null,null,null,null,"2017-09-17",37]
[null,null,null,null,null,null,"2017-09-18",38]
[null,null,null,null,null,null,"2017-09-19",38]
[null,null,null,null,null,null,"2017-09-20",38]
[null,null,null,null,null,null,"2017-09-21",38]
[null,null,null,null,null,null,"2017-09-22",38]
[null,null,null,null,null,null,"2017-09-23",38]
[null,null,null,null,null,null,"2017-09-24",38]
[null,null,null,null,null,null,"2017-09-25",39]
[null,null,null,null,null,null,"2017-09-26",39]
[null,null,null,null,null,null,"2017-09-27",39]
[null,null,null,null,null,null,"2017-09-28",39]
[null,null,null,null,null,null,"2017-09-29",39]
[null,null,null,null,null,null,"2017-09-30",39]
[null,null,null,null,null,null,"2017-10-01",39]
[null,null,null,null,null,null,"2017-10-02",40]
[null,null,null,null,null,null,"2017-10-03",40]
[null,null,null,null,null,null,"2017-10-04",40]
[null,null,null,null,null,null,"2017-10-05",40]
[null,null,null,null,null,null,"2017-10-06",40]
[null,null,null,null,null,null,"2017-10-07",40]
[null,null,null,null,null,null,"2017-10-08",40]
[null,null,null,null,null,null,"2017-10-09",41]
[null,null,null,null,null,null,"2017-10-10",41]
[null,null,null,null,null,null,"2017-10-11",41]
[null,null,null,null,null,null,"2017-10-12",41]
[null,null,null,null,null,null,"2017-10-13",41]
[null,null,null,null,null,null,"2017-10-14",41]
[null,null,null,null,null,null,"2017-10-15",41]
[null,null,null,null,null,null,"2017-10-16",42]
[null,null,null,null,null,null,"2017-10-17",42]
[null,null,null,null,null,null,"2017-10-18",42]
[null,null,null,null,null,null,"2017-10-19",42]
[null,null,null,null,null,null,"2017-10-20",42]
[null,null,null,null,null,null,"2017-10-21",42]
[null,null,null,null,null,null,"2017-10-22",42]
[null,null,null,null,null,null,"2017-10-23",43]
[null,null,null,null,null,null,"2017-10-24",43]
[null,null,null,null,null,null,"2017-10-25",43]
[null,null,null,null,null,null,"2017-10-26",43]
[null,null,null,null,null,null,"2017-10-27",43]
[null,null,null,null,null,null,"2017-10-28",43]
[null,null,null,null,null,null,"2017-10-29",43]
[null,null,null,null,null,null,"2017-10-30",44]
[null,null,null,null,null,null,"2017-10-31",44]
[null,null,null,null,null,null,"2017-11-01",44]
[null,null,null,null,null,null,"2017-11-02",44]
[null,null,null,null,null,null,"2017-11-03",44]
[null,null,null,null,null,null,"2017-11-04",44]
[null,null,null,null,null,null,"2017-11-05",44]
[null,null,null,null,null,null,"2017-11-06",45]
[null,null,null,null,null,null,"2017-11-07",45]
[null,null,null,null,null,null,"2017-11-08",45]
[null,null,null,null,null,null,"2017-11-09",45]
[null,null,null,null,null,null,"2017-11-10",45]
[null,null,null,null,null,null,"2017-11-11",45]
[null,null,null,null,null,null,"2017-11-12",45]
[null,null,null,null,null,null,"2017-11-13",46]
[null,null,null,null,null,null,"2017-11-14",46]
[null,null,null,null,null,null,"2017-11-15",46]
[null,null,null,null,null,null,"2017-11-16",46]
[null,null,null,null,null,null,"2017-11-17",46]
[null,null,null,null,null,null,"2017-11-18",46]
[null,null,null,null,null,null,"2017-11-19",46]
[null,null,null,null,null,null,"2017-11-20",47]
[null,null,null,null,null,null,"2017-11-21",47]
[null,null,null,null,null,null,"2017-11-22",47]
[null,null,null,null,null,null,"2017-11-23",47]
[null,null,null,null,null,null,"2017-11-24",47]
[null,null,null,null,null,null,"2017-11-25",47]
[null,null,null,null,null,null,"2017-11-26",47]
[null,null,null,null,null,null,"2017-11-27",48]
[null,null,null,null,null,null,"2017-11-28",48]
[null,null,null,null,null,null,"2017-11-29",48]
[null,null,null,null,null,null,"2017-11-30",48]
[null,null,null,null,null,null,"2017-12-01",48]
[null,null,null,null,null,null,"2017-12-02",48]
[null,null,null,null,null,null,"2017-12-03",48]
[null,null,null,null,null,null,"2017-12-04",49]
[null,null,null,null,null,null,"2017-12-05",49]
[null,null,null,null,null,null,"2017-12-06",49]
[null,null,null,null,null,null,"2017-12-07",49]
[null,null,null,null,null,null,"2017-12-08",49]
[null,null,null,null,null,null,"2017-12-09",49]
[null,null,null,null,null,null,"2017-12-10",49]
[null,null,null,null,null,null,"2017-12-11",50]
[null,null,null,null,null,null,"2017-12-12",50]
[null,null,null,null,null,null,"2017-12-13",50]
[null,null,null,null,null,null,"2017-12-14",50]
[null,null,null,null,null,null,"2017-12-15",50]
[null,null,null,null,null,null,"2017-12-16",50]
[null,null,null,null,null,null,"2017-12-17",50]
[null,null,null,null,null,null,"2017-12-18",51]
[null,null,null,null,null,null,"2017-12-19",51]
[null,null,null,null,null,null,"2017-12-20",51]
[null,null,null,null,null,null,"2017-12-21",51]
[null,null,null,null,null,null,"2017-12-22",51]
[null,null,null,null,null,null,"2017-12-23",51]
[null,null,null,null,null,null,"2017-12-24",51]
[null,null,null,null,null,null,"2017-12-25",52]
[null,null,null,null,null,null,"2017-12-26",52]
[null,null,null,null,null,null,"2017-12-27",52]
[null,null,null,null,null,null,"2017-12-28",52]
[null,null,null,null,null,null,"2017-12-29",52]
[null,null,null,null,null,null,"2017-12-30",52]
[null,null,null,null,null,null,"2017-12-31",52]
[null,null,null,null,null,null,"2018-01-01",1]
[null,null,null,null,null,null,"2018-01-02",1]
[null,null,null,null,null,null,"2018-01-03",1]
[null,null,null,null,null,null,"2018-01-04",1]
[null,null,null,null,null,null,"2018-01-05",1]
[null,null,null,null,null,null,"2018-01-06",1]
[null,null,null,null,null,null,"2018-01-07",1]
[null,null,null,null,null,null,"2018-01-08",2]
[null,null,null,null,null,null,"2018-01-09",2]
[null,null,null,null,null,null,"2018-01-10",2]
[null,null,null,null,null,null,"2018-01-11",2]
[null,null,null,null,null,null,"2018-01-12",2]
[null,null,null,null,null,null,"2018-01-13",2]
[null,null,null,null,null,null,"2018-01-14",2]
[null,null,null,null,null,null,"2018-01-15",3]
[null,null,null,null,null,null,"2018-01-16",3]
[null,null,null,null,null,null,"2018-01-17",3]
[null,null,null,null,null,null,"2018-01-18",3]
[null,null,null,null,null,null,"2018-01-19",3]
[null,null,null,null,null,null,"2018-01-20",3]
[null,null,null,null,null,null,"2018-01-21",3]
[null,null,null,null,null,null,"2018-01-22",4]
[null,null,null,null,null,null,"2018-01-23",4]
[null,null,null,null,null,null,"2018-01-24",4]
[null,null,null,null,null,null,"2018-01-25",4]
[null,null,null,null,null,null,"2018-01-26",4]
[null,null,null,null,null,null,"2018-01-27",4]
[null,null,null,null,null,null,"2018-01-28",4]
[null,null,null,null,null,null,"2018-01-29",5]
[null,null,null,null,null,null,"2018-01-30",5]
[null,null,null,null,null,null,"2018-01-31",5]
[null,null,null,null,null,null,"2018-02-01",5]
[null,null,null,null,null,null,"2018-02-02",5]
[null,null,null,null,null,null,"2018-02-03",5]
[null,null,null,null,null,null,"2018-02-04",5]
[null,null,null,null,null,null,"2018-02-05",6]
[null,null,null,null,null,null,"2018-02-06",6]
[null,null,null,null,null,null,"2018-02-07",6]
[null,null,null,null,null,null,"2018-02-08",6]
[null,null,null,null,null,null,"2018-02-09",6]
[null,null,null,null,null,null,"2018-02-10",6]
[null,null,null,null,null,null,"2018-02-11",6]
[null,null,null,null,null,null,"2018-02-12",7]
[null,null,null,null,null,null,"2018-02-13",7]
[null,null,null,null,null,null,"2018-02-14",7]
[null,null,null,null,null,null,"2018-02-15",7]
[null,null,null,null,null,null,"2018-02-16",7]
[null,null,null,null,null,null,"2018-02-17",7]
[null,null,null,null,null,null,"2018-02-18",7]
[null,null,null,null,null,null,"2018-02-19",8]
[null,null,null,null,null,null,"2018-02-20",8]
[null,null,null,null,null,null,"2018-02-21",8]
[null,null,null,null,null,null,"2018-02-22",8]
[null,null,null,null,null,null,"2018-02-23",8]
[null,null,null,null,null,null,"2018-02-24",8]
[null,null,null,null,null,null,"2018-02-25",8]
[null,null,null,null,null,null,"2018-02-26",9]
[null,null,null,null,null,null,"2018-02-27",9]
[null,null,null,null,null,null,"2018-02-28",9]
[null,null,null,null,null,null,"2018-03-01",9]
[null,null,null,null,null,null,"2018-03-02",9]
[null,null,null,null,null,null,"2018-03-03",9]
[null,null,null,null,null,null,"2018-03-04",9]
[null,null,null,null,null,null,"2018-03-05",10]
[null,null,null,null,null,null,"2018-03-06",10]
[null,null,null,null,null,null,"2018-03-07",10]
[null,null,null,null,null,null,"2018-03-08",10]
[null,null,null,null,null,null,"2018-03-09",10]
[null,null,null,null,null,null,"2018-03-10",10]
[null,null,null,null,null,null,"2018-03-11",10]
[null,null,null,null,null,null,"2018-03-12",11]
[null,null,null,null,null,null,"2018-03-13",11]
[null,null,null,null,null,null,"2018-03-14",11]
[null,null,null,null,null,null,"2018-03-15",11]
[null,null,null,null,null,null,"2018-03-16",11]
[null,null,null,null,null,null,"2018-03-17",11]
[null,null,null,null,null,null,"2018-03-18",11]
[null,null,null,null,null,null,"2018-03-19",12]
[null,null,null,null,null,null,"2018-03-20",12]
[null,null,null,null,null,null,"2018-03-21",12]
[null,null,null,null,null,null,"2018-03-22",12]
[null,null,null,null,null,null,"2018-03-23",12]
[null,null,null,null,null,null,"2018-03-24",12]
[null,null,null,null,null,null,"2018-03-25",12]
[null,null,null,null,null,null,"2018-03-26",13]
[null,null,null,null,null,null,"2018-03-27",13]
[null,null,null,null,null,null,"2018-03-28",13]
[null,null,null,null,null,null,"2018-03-29",13]
[null,null,null,null,null,null,"2018-03-30",13]
[null,null,null,null,null,null,"2018-03-31",13]
[null,null,null,null,null,null,"2018-04-01",13]
[null,null,null,null,null,null,"2018-04-02",14]
[null,null,null,null,null,null,"2018-04-03",14]
[null,null,null,null,null,null,"2018-04-04",14]
[null,null,null,null,null,null,"2018-04-05",14]
[null,null,null,null,null,null,"2018-04-06",14]
[null,null,null,null,null,null,"2018-04-07",14]
[null,null,null,null,null,null,"2018-04-08",14]
[null,null,null,null,null,null,"2018-04-09",15]
[null,null,null,null,null,null,"2018-04-10",15]
[null,null,null,null,null,null,"2018-04-11",15]
[null,null,null,null,null,null,"2018-04-12",15]
[null,null,null,null,null,null,"2018-04-13",15]
[null,null,null,null,null,null,"2018-04-14",15]
[null,null,null,null,null,null,"2018-04-15",15]
[null,null,null,null,null,null,"2018-04-16",16]
[null,null,null,null,null,null,"2018-04-17",16]
[null,null,null,null,null,null,"2018-04-18",16]
[null,null,null,null,null,null,"2018-04-19",16]
[null,null,null,null,null,null,"2018-04-20",16]
[null,null,null,null,null,null,"2018-04-21",16]
[null,null,null,null,null,null,"2018-04-22",16]
[null,null,null,null,null,null,"2018-04-23",17]
[null,null,null,null,null,null,"2018-04-24",17]
[null,null,null,null,null,null,"2018-04-25",17]
[null,null,null,null,null,null,"2018-04-26",17]
[null,null,null,null,null,null,"2018-04-27",17]
[null,null,null,null,null,null,"2018-04-28",17]
[null,null,null,null,null,null,"2018-04-29",17]
[null,null,null,null,null,null,"2018-04-30",18]
[null,null,null,null,null,null,"2018-05-01",18]
[null,null,null,null,null,null,"2018-05-02",18]
[null,null,null,null,null,null,"2018-05-03",18]
[null,null,null,null,null,null,"2018-05-04",18]
[null,null,null,null,null,null,"2018-05-05",18]
[null,null,null,null,null,null,"2018-05-06",18]
[null,null,null,null,null,null,"2018-05-07",19]
[null,null,null,null,null,null,"2018-05-08",19]
[null,null,null,null,null,null,"2018-05-09",19]
[null,null,null,null,null,null,"2018-05-10",19]
[null,null,null,null,null,null,"2018-05-11",19]
[null,null,null,null,null,null,"2018-05-12",19]
[null,null,null,null,null,null,"2018-05-13",19]
[null,null,null,null,null,null,"2018-05-14",20]
[null,null,null,null,null,null,"2018-05-15",20]
[null,null,null,null,null,null,"2018-05-16",20]
[null,null,null,null,null,null,"2018-05-17",20]
[null,null,null,null,null,null,"2018-05-18",20]
[null,null,null,null,null,null,"2018-05-19",20]
[null,null,null,null,null,null,"2018-05-20",20]
[null,null,null,null,null,null,"2018-05-21",21]
[null,null,null,null,null,null,"2018-05-22",21]
[null,null,null,null,null,null,"2018-05-23",21]
[null,null,null,null,null,null,"2018-05-24",21]
[null,null,null,null,null,null,"2018-05-25",21]
[null,null,null,null,null,null,"2018-05-26",21]
[null,null,null,null,null,null,"2018-05-27",21]
[null,null,null,null,null,null,"2018-05-28",22]
[null,null,null,null,null,null,"2018-05-29",22]
[null,null,null,null,null,null,"2018-05-30",22]
[null,null,null,null,null,null,"2018-05-31",22]
[null,null,null,null,null,null,"2018-06-01",22]
[null,null,null,null,null,null,"2018-06-02",22]
[null,null,null,null,null,null,"2018-06-03",22]
[null,null,null,null,null,null,"2018-06-04",23]
[null,null,null,null,null,null,"2018-06-05",23]
[null,null,null,null,null,null,"2018-06-06",23]
[null,null,null,null,null,null,"2018-06-07",23]
[null,null,null,null,null,null,"2018-06-08",23]
[null,null,null,null,null,null,"2018-06-09",23]
[null,null,null,null,null,null,"2018-06-10",23]
[null,null,null,null,null,null,"2018-06-11",24]
[null,null,null,null,null,null,"2018-06-12",24]
[null,null,null,null,null,null,"2018-06-13",24]
[null,null,null,null,null,null,"2018-06-14",24]
[null,null,null,null,null,null,"2018-06-15",24]
[null,null,null,null,null,null,"2018-06-16",24]
[null,null,null,null,null,null,"2018-06-17",24]
[null,null,null,null,null,null,"2018-06-18",25]
[null,null,null,null,null,null,"2018-06-19",25]
[null,null,null,null,null,null,"2018-06-20",25]
[null,null,null,null,null,null,"2018-06-21",25]
[null,null,null,null,null,null,"2018-06-22",25]
[null,null,null,null,null,null,"2018-06-23",25]
[null,null,null,null,null,null,"2018-06-24",25]
[null,null,null,null,null,null,"2018-06-25",26]
[null,null,null,null,null,null,"2018-06-26",26]
[null,null,null,null,null,null,"2018-06-27",26]
[null,null,null,null,null,null,"2018-06-28",26]
[null,null,null,null,null,null,"2018-06-29",26]
[null,null,null,null,null,null,"2018-06-30",26]
[null,null,null,null,null,null,"2018-07-01",26]
[null,null,null,null,null,null,"2018-07-02",27]
[null,null,null,null,null,null,"2018-07-03",27]
[null,null,null,null,null,null,"2018-07-04",27]
[null,null,null,null,null,null,"2018-07-05",27]
[null,null,null,null,null,null,"2018-07-06",27]
[null,null,null,null,null,null,"2018-07-07",27]
[null,null,null,null,null,null,"2018-07-08",27]
[null,null,null,null,null,null,"2018-07-09",28]
[null,null,null,null,null,null,"2018-07-10",28]
[null,null,null,null,null,null,"2018-07-11",28]
[null,null,null,null,null,null,"2018-07-12",28]
[null,null,null,null,null,null,"2018-07-13",28]
[null,null,null,null,null,null,"2018-07-14",28]
[null,null,null,null,null,null,"2018-07-15",28]
[null,null,null,null,null,null,"2018-07-16",29]
[null,null,null,null,null,null,"2018-07-17",29]
[null,null,null,null,null,null,"2018-07-18",29]
[null,null,null,null,null,null,"2018-07-19",29]
[null,null,null,null,null,null,"2018-07-20",29]
[null,null,null,null,null,null,"2018-07-21",29]
[null,null,null,null,null,null,"2018-07-22",29]
[null,null,null,null,null,null,"2018-07-23",30]
[null,null,null,null,null,null,"2018-07-24",30]
[null,null,null,null,null,null,"2018-07-25",30]
[null,null,null,null,null,null,"2018-07-26",30]
[null,null,null,null,null,null,"2018-07-27",30]
[null,null,null,null,null,null,"2018-07-28",30]
[null,null,null,null,null,null,"2018-07-29",30]
[null,null,null,null,null,null,"2018-07-30",31]
[null,null,null,null,null,null,"2018-07-31",31]
[null,null,null,null,null,null,"2018-08-01",31]
[null,null,null,null,null,null,"2018-08-02",31]
[null,null,null,null,null,null,"2018-08-03",31]
[null,null,null,null,null,null,"2018-08-04",31]
[null,null,null,null,null,null,"2018-08-05",31]
[null,null,null,null,null,null,"2018-08-06",32]
[null,null,null,null,null,null,"2018-08-07",32]
[null,null,null,null,null,null,"2018-08-08",32]
[null,null,null,null,null,null,"2018-08-09",32]
[null,null,null,null,null,null,"2018-08-10",32]
[null,null,null,null,null,null,"2018-08-11",32]
[null,null,null,null,null,null,"2018-08-12",32]
[null,null,null,null,null,null,"2018-08-13",33]
[null,null,null,null,null,null,"2018-08-14",33]
[null,null,null,null,null,null,"2018-08-15",33]
[null,null,null,null,null,null,"2018-08-16",33]
[null,null,null,null,null,null,"2018-08-17",33]
[null,null,null,null,null,null,"2018-08-18",33]
[null,null,null,null,null,null,"2018-08-19",33]
[null,null,null,null,null,null,"2018-08-20",34]
[null,null,null,null,null,null,"2018-08-21",34]
[null,null,null,null,null,null,"2018-08-22",34]
[null,null,null,null,null,null,"2018-08-23",34]
[null,null,null,null,null,null,"2018-08-24",34]
[null,null,null,null,null,null,"2018-08-25",34]
[null,null,null,null,null,null,"2018-08-26",34]
[null,null,null,null,null,null,"2018-08-27",35]
[null,null,null,null,null,null,"2018-08-28",35]
[null,null,null,null,null,null,"2018-08-29",35]
[null,null,null,null,null,null,"2018-08-30",35]
[null,null,null,null,null,null,"2018-08-31",35]
[null,null,null,null,null,null,"2018-09-01",35]
[null,null,null,null,null,null,"2018-09-02",35]
[null,null,null,null,null,null,"2018-09-03",36]
[null,null,null,null,null,null,"2018-09-04",36]
[null,null,null,null,null,null,"2018-09-05",36]
[null,null,null,null,null,null,"2018-09-06",36]
[null,null,null,null,null,null,"2018-09-07",36]
[null,null,null,null,null,null,"2018-09-08",36]
[null,null,null,null,null,null,"2018-09-09",36]
[null,null,null,null,null,null,"2018-09-10",37]
[null,null,null,null,null,null,"2018-09-11",37]
[null,null,null,null,null,null,"2018-09-12",37]
[null,null,null,null,null,null,"2018-09-13",37]
[null,null,null,null,null,null,"2018-09-14",37]
[null,null,null,null,null,null,"2018-09-15",37]
[null,null,null,null,null,null,"2018-09-16",37]
[null,null,null,null,null,null,"2018-09-17",38]
[null,null,null,null,null,null,"2018-09-18",38]
[null,null,null,null,null,null,"2018-09-19",38]
[null,null,null,null,null,null,"2018-09-20",38]
[null,null,null,null,null,null,"2018-09-21",38]
[null,null,null,null,null,null,"2018-09-22",38]
[null,null,null,null,null,null,"2018-09-23",38]
[null,null,null,null,null,null,"2018-09-24",39]
[null,null,null,null,null,null,"2018-09-25",39]
[null,null,null,null,null,null,"2018-09-26",39]
[null,null,null,null,null,null,"2018-09-27",39]
[null,null,null,null,null,null,"2018-09-28",39]
[null,null,null,null,null,null,"2018-09-29",39]
[null,null,null,null,null,null,"2018-09-30",39]
[null,null,null,null,null,null,"2018-10-01",40]
[null,null,null,null,null,null,"2018-10-02",40]
[null,null,null,null,null,null,"2018-10-03",40]
[null,null,null,null,null,null,"2018-10-04",40]
[null,null,null,null,null,null,"2018-10-05",40]
[null,null,null,null,null,null,"2018-10-06",40]
[null,null,null,null,null,null,"2018-10-07",40]
[null,null,null,null,null,null,"2018-10-08",41]
[null,null,null,null,null,null,"2018-10-09",41]
[null,null,null,null,null,null,"2018-10-10",41]
[null,null,null,null,null,null,"2018-10-11",41]
[null,null,null,null,null,null,"2018-10-12",41]
[null,null,null,null,null,null,"2018-10-13",41]
[null,null,null,null,null,null,"2018-10-14",41]
[null,null,null,null,null,null,"2018-10-15",42]
[null,null,null,null,null,null,"2018-10-16",42]
[null,null,null,null,null,null,"2018-10-17",42]
[null,null,null,null,null,null,"2018-10-18",42]
[null,null,null,null,null,null,"2018-10-19",42]
[null,null,null,null,null,null,"2018-10-20",42]
[null,null,null,null,null,null,"2018-10-21",42]
[null,null,null,null,null,null,"2018-10-22",43]
[null,null,null,null,null,null,"2018-10-23",43]
[null,null,null,null,null,null,"2018-10-24",43]
[null,null,null,null,null,null,"2018-10-25",43]
[null,null,null,null,null,null,"2018-10-26",43]
[null,null,null,null,null,null,"2018-10-27",43]
[null,null,null,null,null,null,"2018-10-28",43]
[null,null,null,null,null,null,"2018-10-29",44]
[null,null,null,null,null,null,"2018-10-30",44]
[null,null,null,null,null,null,"2018-10-31",44]
[null,null,null,null,null,null,"2018-11-01",44]
[null,null,null,null,null,null,"2018-11-02",44]
[null,null,null,null,null,null,"2018-11-03",44]
[null,null,null,null,null,null,"2018-11-04",44]
[null,null,null,null,null,null,"2018-11-05",45]
[null,null,null,null,null,null,"2018-11-06",45]
[null,null,null,null,null,null,"2018-11-07",45]
[null,null,null,null,null,null,"2018-11-08",45]
[null,null,null,null,null,null,"2018-11-09",45]
[null,null,null,null,null,null,"2018-11-10",45]
[null,null,null,null,null,null,"2018-11-11",45]
[null,null,null,null,null,null,"2018-11-12",46]
[null,null,null,null,null,null,"2018-11-13",46]
[null,null,null,null,null,null,"2018-11-14",46]
[null,null,null,null,null,null,"2018-11-15",46]
[null,null,null,null,null,null,"2018-11-16",46]
[null,null,null,null,null,null,"2018-11-17",46]
[null,null,null,null,null,null,"2018-11-18",46]
[null,null,null,null,null,null,"2018-11-19",47]
[null,null,null,null,null,null,"2018-11-20",47]
[null,null,null,null,null,null,"2018-11-21",47]
[null,null,null,null,null,null,"2018-11-22",47]
[null,null,null,null,null,null,"2018-11-23",47]
[null,null,null,null,null,null,"2018-11-24",47]
[null,null,null,null,null,null,"2018-11-25",47]
[null,null,null,null,null,null,"2018-11-26",48]
[null,null,null,null,null,null,"2018-11-27",48]
[null,null,null,null,null,null,"2018-11-28",48]
[null,null,null,null,null,null,"2018-11-29",48]
[null,null,null,null,null,null,"2018-11-30",48]
[null,null,null,null,null,null,"2018-12-01",48]
[null,null,null,null,null,null,"2018-12-02",48]
[null,null,null,null,null,null,"2018-12-03",49]
[null,null,null,null,null,null,"2018-12-04",49]
[null,null,null,null,null,null,"2018-12-05",49]
[null,null,null,null,null,null,"2018-12-06",49]
[null,null,null,null,null,null,"2018-12-07",49]
[null,null,null,null,null,null,"2018-12-08",49]
[null,null,null,null,null,null,"2018-12-09",49]
[null,null,null,null,null,null,"2018-12-10",50]
[null,null,null,null,null,null,"2018-12-11",50]
[null,null,null,null,null,null,"2018-12-12",50]
[null,null,null,null,null,null,"2018-12-13",50]
[null,null,null,null,null,null,"2018-12-14",50]
[null,null,null,null,null,null,"2018-12-15",50]
[null,null,null,null,null,null,"2018-12-16",50]
[null,null,null,null,null,null,"2018-12-17",51]
[null,null,null,null,null,null,"2018-12-18",51]
[null,null,null,null,null,null,"2018-12-19",51]
[null,null,null,null,null,null,"2018-12-20",51]
[null,null,null,null,null,null,"2018-12-21",51]
[null,null,null,null,null,null,"2018-12-22",51]
[null,null,null,null,null,null,"2018-12-23",51]
[null,null,null,null,null,null,"2018-12-24",52]
[null,null,null,null,null,null,"2018-12-25",52]
[null,null,null,null,null,null,"2018-12-26",52]
[null,null,null,null,null,null,"2018-12-27",52]
[null,null,null,null,null,null,"2018-12-28",52]
[null,null,null,null,null,null,"2018-12-29",52]
[null,null,null,null,null,null,"2018-12-30",52]
[null,null,null,null,null,null,"2018-12-31",1]
[null,null,null,null,null,null,"2019-01-01",1]
[null,null,null,null,null,null,"2019-01-02",1]
[null,null,null,null,null,null,"2019-01-03",1]
[null,null,null,null,null,null,"2019-01-04",1]
[null,null,null,null,null,null,"2019-01-05",1]
[null,null,null,null,null,null,"2019-01-06",1]
[null,null,null,null,null,null,"2019-01-07",2]
[null,null,null,null,null,null,"2019-01-08",2]
[null,null,null,null,null,null,"2019-01-09",2]
[null,null,null,null,null,null,"2019-01-10",2]
[null,null,null,null,null,null,"2019-01-11",2]
[null,null,null,null,null,null,"2019-01-12",2]
[null,null,null,null,null,null,"2019-01-13",2]
[null,null,null,null,null,null,"2019-01-14",3]
[null,null,null,null,null,null,"2019-01-15",3]
[null,null,null,null,null,null,"2019-01-16",3]
[null,null,null,null,null,null,"2019-01-17",3]
[null,null,null,null,null,null,"2019-01-18",3]
[null,null,null,null,null,null,"2019-01-19",3]
[null,null,null,null,null,null,"2019-01-20",3]
[null,null,null,null,null,null,"2019-01-21",4]
[null,null,null,null,null,null,"2019-01-22",4]
[null,null,null,null,null,null,"2019-01-23",4]
[null,null,null,null,null,null,"2019-01-24",4]
[null,null,null,null,null,null,"2019-01-25",4]
[null,null,null,null,null,null,"2019-01-26",4]
[null,null,null,null,null,null,"2019-01-27",4]
[null,null,null,null,null,null,"2019-01-28",5]
[null,null,null,null,null,null,"2019-01-29",5]
[null,null,null,null,null,null,"2019-01-30",5]
[null,null,null,null,null,null,"2019-01-31",5]
[null,null,null,null,null,null,"2019-02-01",5]
[null,null,null,null,null,null,"2019-02-02",5]
[null,null,null,null,null,null,"2019-02-03",5]
[null,null,null,null,null,null,"2019-02-04",6]
[null,null,null,null,null,null,"2019-02-05",6]
[null,null,null,null,null,null,"2019-02-06",6]
[null,null,null,null,null,null,"2019-02-07",6]
[null,null,null,null,null,null,"2019-02-08",6]
[null,null,null,null,null,null,"2019-02-09",6]
[null,null,null,null,null,null,"2019-02-10",6]
[null,null,null,null,null,null,"2019-02-11",7]
[null,null,null,null,null,null,"2019-02-12",7]
[null,null,null,null,null,null,"2019-02-13",7]
[null,null,null,null,null,null,"2019-02-14",7]
[null,null,null,null,null,null,"2019-02-15",7]
[null,null,null,null,null,null,"2019-02-16",7]
[null,null,null,null,null,null,"2019-02-17",7]
[null,null,null,null,null,null,"2019-02-18",8]
[null,null,null,null,null,null,"2019-02-19",8]
[null,null,null,null,null,null,"2019-02-20",8]
[null,null,null,null,null,null,"2019-02-21",8]
[null,null,null,null,null,null,"2019-02-22",8]
[null,null,null,null,null,null,"2019-02-23",8]
[null,null,null,null,null,null,"2019-02-24",8]
[null,null,null,null,null,null,"2019-02-25",9]
[null,null,null,null,null,null,"2019-02-26",9]
[null,null,null,null,null,null,"2019-02-27",9]
[null,null,null,null,null,null,"2019-02-28",9]
[null,null,null,null,null,null,"2019-03-01",9]
[null,null,null,null,null,null,"2019-03-02",9]
[null,null,null,null,null,null,"2019-03-03",9]
[null,null,null,null,null,null,"2019-03-04",10]
[null,null,null,null,null,null,"2019-03-05",10]
[null,null,null,null,null,null,"2019-03-06",10]
[null,null,null,null,null,null,"2019-03-07",10]
[null,null,null,null,null,null,"2019-03-08",10]
[null,null,null,null,null,null,"2019-03-09",10]
[null,null,null,null,null,null,"2019-03-10",10]
[null,null,null,null,null,null,"2019-03-11",11]
[null,null,null,null,null,null,"2019-03-12",11]
[null,null,null,null,null,null,"2019-03-13",11]
[null,null,null,null,null,null,"2019-03-14",11]
[null,null,null,null,null,null,"2019-03-15",11]
[null,null,null,null,null,null,"2019-03-16",11]
[null,null,null,null,null,null,"2019-03-17",11]
[null,null,null,null,null,null,"2019-03-18",12]
[null,null,null,null,null,null,"2019-03-19",12]
[null,null,null,null,null,null,"2019-03-20",12]
[null,null,null,null,null,null,"2019-03-21",12]
[null,null,null,null,null,null,"2019-03-22",12]
[null,null,null,null,null,null,"2019-03-23",12]
[null,null,null,null,null,null,"2019-03-24",12]
[null,null,null,null,null,null,"2019-03-25",13]
[null,null,null,null,null,null,"2019-03-26",13]
[null,null,null,null,null,null,"2019-03-27",13]
[null,null,null,null,null,null,"2019-03-28",13]
[null,null,null,null,null,null,"2019-03-29",13]
[null,null,null,null,null,null,"2019-03-30",13]
[null,null,null,null,null,null,"2019-03-31",13]
[null,null,null,null,null,null,"2019-04-01",14]
[null,null,null,null,null,null,"2019-04-02",14]
[null,null,null,null,null,null,"2019-04-03",14]
[null,null,null,null,null,null,"2019-04-04",14]
[null,null,null,null,null,null,"2019-04-05",14]
[null,null,null,null,null,null,"2019-04-06",14]
[null,null,null,null,null,null,"2019-04-07",14]
[null,null,null,null,null,null,"2019-04-08",15]
[null,null,null,null,null,null,"2019-04-09",15]
[null,null,null,null,null,null,"2019-04-10",15]
[null,null,null,null,null,null,"2019-04-11",15]
[null,null,null,null,null,null,"2019-04-12",15]
[null,null,null,null,null,null,"2019-04-13",15]
[null,null,null,null,null,null,"2019-04-14",15]
[null,null,null,null,null,null,"2019-04-15",16]
[null,null,null,null,null,null,"2019-04-16",16]
[null,null,null,null,null,null,"2019-04-17",16]
[null,null,null,null,null,null,"2019-04-18",16]
[null,null,null,null,null,null,"2019-04-19",16]
[null,null,null,null,null,null,"2019-04-20",16]
[null,null,null,null,null,null,"2019-04-21",16]
[null,null,null,null,null,null,"2019-04-22",17]
[null,null,null,null,null,null,"2019-04-23",17]
[null,null,null,null,null,null,"2019-04-24",17]
[null,null,null,null,null,null,"2019-04-25",17]
[null,null,null,null,null,null,"2019-04-26",17]
[null,null,null,null,null,null,"2019-04-27",17]
[null,null,null,null,null,null,"2019-04-28",17]
[null,null,null,null,null,null,"2019-04-29",18]
[null,null,null,null,null,null,"2019-04-30",18]
[null,null,null,null,null,null,"2019-05-01",18]
[null,null,null,null,null,null,"2019-05-02",18]
[null,null,null,null,null,null,"2019-05-03",18]
[null,null,null,null,null,null,"2019-05-04",18]
[null,null,null,null,null,null,"2019-05-05",18]
[null,null,null,null,null,null,"2019-05-06",19]
[null,null,null,null,null,null,"2019-05-07",19]
[null,null,null,null,null,null,"2019-05-08",19]
[null,null,null,null,null,null,"2019-05-09",19]
[null,null,null,null,null,null,"2019-05-10",19]
[null,null,null,null,null,null,"2019-05-11",19]
[null,null,null,null,null,null,"2019-05-12",19]
[null,null,null,null,null,null,"2019-05-13",20]
[null,null,null,null,null,null,"2019-05-14",20]
[null,null,null,null,null,null,"2019-05-15",20]
[null,null,null,null,null,null,"2019-05-16",20]
[null,null,null,null,null,null,"2019-05-17",20]
[null,null,null,null,null,null,"2019-05-18",20]
[null,null,null,null,null,null,"2019-05-19",20]
[null,null,null,null,null,null,"2019-05-20",21]
[null,null,null,null,null,null,"2019-05-21",21]
[null,null,null,null,null,null,"2019-05-22",21]
[null,null,null,null,null,null,"2019-05-23",21]
[null,null,null,null,null,null,"2019-05-24",21]
[null,null,null,null,null,null,"2019-05-25",21]
[null,null,null,null,null,null,"2019-05-26",21]
[null,null,null,null,null,null,"2019-05-27",22]
[null,null,null,null,null,null,"2019-05-28",22]
[null,null,null,null,null,null,"2019-05-29",22]
[null,null,null,null,null,null,"2019-05-30",22]
[null,null,null,null,null,null,"2019-05-31",22]
[null,null,null,null,null,null,"2019-06-01",22]
[null,null,null,null,null,null,"2019-06-02",22]
[null,null,null,null,null,null,"2019-06-03",23]
[null,null,null,null,null,null,"2019-06-04",23]
[null,null,null,null,null,null,"2019-06-05",23]
[null,null,null,null,null,null,"2019-06-06",23]
[null,null,null,null,null,null,"2019-06-07",23]
[null,null,null,null,null,null,"2019-06-08",23]
[null,null,null,null,null,null,"2019-06-09",23]
[null,null,null,null,null,null,"2019-06-10",24]
[null,null,null,null,null,null,"2019-06-11",24]
[null,null,null,null,null,null,"2019-06-12",24]
[null,null,null,null,null,null,"2019-06-13",24]
[null,null,null,null,null,null,"2019-06-14",24]
[null,null,null,null,null,null,"2019-06-15",24]
[null,null,null,null,null,null,"2019-06-16",24]
[null,null,null,null,null,null,"2019-06-17",25]
[null,null,null,null,null,null,"2019-06-18",25]
[null,null,null,null,null,null,"2019-06-19",25]
[null,null,null,null,null,null,"2019-06-20",25]
[null,null,null,null,null,null,"2019-06-21",25]
[null,null,null,null,null,null,"2019-06-22",25]
[null,null,null,null,null,null,"2019-06-23",25]
[null,null,null,null,null,null,"2019-06-24",26]
[null,null,null,null,null,null,"2019-06-25",26]
[null,null,null,null,null,null,"2019-06-26",26]
[null,null,null,null,null,null,"2019-06-27",26]
[null,null,null,null,null,null,"2019-06-28",26]
[null,null,null,null,null,null,"2019-06-29",26]
[null,null,null,null,null,null,"2019-06-30",26]
[null,null,null,null,null,null,"2019-07-01",27]
[null,null,null,null,null,null,"2019-07-02",27]
[null,null,null,null,null,null,"2019-07-03",27]
[null,null,null,null,null,null,"2019-07-04",27]
[null,null,null,null,null,null,"2019-07-05",27]
[null,null,null,null,null,null,"2019-07-06",27]
[null,null,null,null,null,null,"2019-07-07",27]
[null,null,null,null,null,null,"2019-07-08",28]
[null,null,null,null,null,null,"2019-07-09",28]
[null,null,null,null,null,null,"2019-07-10",28]
[null,null,null,null,null,null,"2019-07-11",28]
[null,null,null,null,null,null,"2019-07-12",28]
[null,null,null,null,null,null,"2019-07-13",28]
[null,null,null,null,null,null,"2019-07-14",28]
[null,null,null,null,null,null,"2019-07-15",29]
[null,null,null,null,null,null,"2019-07-16",29]
[null,null,null,null,null,null,"2019-07-17",29]
[null,null,null,null,null,null,"2019-07-18",29]
[null,null,null,null,null,null,"2019-07-19",29]
[null,null,null,null,null,null,"2019-07-20",29]
[null,null,null,null,null,null,"2019-07-21",29]
[null,null,null,null,null,null,"2019-07-22",30]
[null,null,null,null,null,null,"2019-07-23",30]
[null,null,null,null,null,null,"2019-07-24",30]
[null,null,null,null,null,null,"2019-07-25",30]
[null,null,null,null,null,null,"2019-07-26",30]
[null,null,null,null,null,null,"2019-07-27",30]
[null,null,null,null,null,null,"2019-07-28",30]
[null,null,null,null,null,null,"2019-07-29",31]
[null,null,null,null,null,null,"2019-07-30",31]
[null,null,null,null,null,null,"2019-07-31",31]
[null,null,null,null,null,null,"2019-08-01",31]
[null,null,null,null,null,null,"2019-08-02",31]
[null,null,null,null,null,null,"2019-08-03",31]
[null,null,null,null,null,null,"2019-08-04",31]
[null,null,null,null,null,null,"2019-08-05",32]
[null,null,null,null,null,null,"2019-08-06",32]
[null,null,null,null,null,null,"2019-08-07",32]
[null,null,null,null,null,null,"2019-08-08",32]
[null,null,null,null,null,null,"2019-08-09",32]
[null,null,null,null,null,null,"2019-08-10",32]
[null,null,null,null,null,null,"2019-08-11",32]
[null,null,null,null,null,null,"2019-08-12",33]
[null,null,null,null,null,null,"2019-08-13",33]
[null,null,null,null,null,null,"2019-08-14",33]
[null,null,null,null,null,null,"2019-08-15",33]
[null,null,null,null,null,null,"2019-08-16",33]
[null,null,null,null,null,null,"2019-08-17",33]
[null,null,null,null,null,null,"2019-08-18",33]
[null,null,null,null,null,null,"2019-08-19",34]
[null,null,null,null,null,null,"2019-08-20",34]
[null,null,null,null,null,null,"2019-08-21",34]
[null,null,null,null,null,null,"2019-08-22",34]
[null,null,null,null,null,null,"2019-08-23",34]
[null,null,null,null,null,null,"2019-08-24",34]
[null,null,null,null,null,null,"2019-08-25",34]
[null,null,null,null,null,null,"2019-08-26",35]
[null,null,null,null,null,null,"2019-08-27",35]
[null,null,null,null,null,null,"2019-08-28",35]
[null,null,null,null,null,null,"2019-08-29",35]
[null,null,null,null,null,null,"2019-08-30",35]
[null,null,null,null,null,null,"2019-08-31",35]
[null,null,null,null,null,null,"2019-09-01",35]
[null,null,null,null,null,null,"2019-09-02",36]
[null,null,null,null,null,null,"2019-09-03",36]
[null,null,null,null,null,null,"2019-09-04",36]
[null,null,null,null,null,null,"2019-09-05",36]
[null,null,null,null,null,null,"2019-09-06",36]
[null,null,null,null,null,null,"2019-09-07",36]
[null,null,null,null,null,null,"2019-09-08",36]
[null,null,null,null,null,null,"2019-09-09",37]
[null,null,null,null,null,null,"2019-09-10",37]
[null,null,null,null,null,null,"2019-09-11",37]
[null,null,null,null,null,null,"2019-09-12",37]
[null,null,null,null,null,null,"2019-09-13",37]
[null,null,null,null,null,null,"2019-09-14",37]
[null,null,null,null,null,null,"2019-09-15",37]
[null,null,null,null,null,null,"2019-09-16",38]
[null,null,null,null,null,null,"2019-09-17",38]
[null,null,null,null,null,null,"2019-09-18",38]
[null,null,null,null,null,null,"2019-09-19",38]
[null,null,null,null,null,null,"2019-09-20",38]
[null,null,null,null,null,null,"2019-09-21",38]
[null,null,null,null,null,null,"2019-09-22",38]
[null,null,null,null,null,null,"2019-09-23",39]
[null,null,null,null,null,null,"2019-09-24",39]
[null,null,null,null,null,null,"2019-09-25",39]
[null,null,null,null,null,null,"2019-09-26",39]
[null,null,null,null,null,null,"2019-09-27",39]
[null,null,null,null,null,null,"2019-09-28",39]
[null,null,null,null,null,null,"2019-09-29",39]
[null,null,null,null,null,null,"2019-09-30",40]
[null,null,null,null,null,null,"2019-10-01",40]
[null,null,null,null,null,null,"2019-10-02",40]
[null,null,null,null,null,null,"2019-10-03",40]
[null,null,null,null,null,null,"2019-10-04",40]
[null,null,null,null,null,null,"2019-10-05",40]
[null,null,null,null,null,null,"2019-10-06",40]
[null,null,null,null,null,null,"2019-10-07",41]
[null,null,null,null,null,null,"2019-10-08",41]
[null,null,null,null,null,null,"2019-10-09",41]
[null,null,null,null,null,null,"2019-10-10",41]
[null,null,null,null,null,null,"2019-10-11",41]
[null,null,null,null,null,null,"2019-10-12",41]
[null,null,null,null,null,null,"2019-10-13",41]
[null,null,null,null,null,null,"2019-10-14",42]
[null,null,null,null,null,null,"2019-10-15",42]
[null,null,null,null,null,null,"2019-10-16",42]
[null,null,null,null,null,null,"2019-10-17",42]
[null,null,null,null,null,null,"2019-10-18",42]
[null,null,null,null,null,null,"2019-10-19",42]
[null,null,null,null,null,null,"2019-10-20",42]
[null,null,null,null,null,null,"2019-10-21",43]
[null,null,null,null,null,null,"2019-10-22",43]
[null,null,null,null,null,null,"2019-10-23",43]
[null,null,null,null,null,null,"2019-10-24",43]
[null,null,null,null,null,null,"2019-10-25",43]
[null,null,null,null,null,null,"2019-10-26",43]
[null,null,null,null,null,null,"2019-10-27",43]
[null,null,null,null,null,null,"2019-10-28",44]
[null,null,null,null,null,null,"2019-10-29",44]
[null,null,null,null,null,null,"2019-10-30",44]
[null,null,null,null,null,null,"2019-10-31",44]
[null,null,null,null,null,null,"2019-11-01",44]
[null,null,null,null,null,null,"2019-11-02",44]
[null,null,null,null,null,null,"2019-11-03",44]
[null,null,null,null,null,null,"2019-11-04",45]
[null,null,null,null,null,null,"2019-11-05",45]
[null,null,null,null,null,null,"2019-11-06",45]
[null,null,null,null,null,null,"2019-11-07",45]
[null,null,null,null,null,null,"2019-11-08",45]
[null,null,null,null,null,null,"2019-11-09",45]
[null,null,null,null,null,null,"2019-11-10",45]
[null,null,null,null,null,null,"2019-11-11",46]
[null,null,null,null,null,null,"2019-11-12",46]
[null,null,null,null,null,null,"2019-11-13",46]
[null,null,null,null,null,null,"2019-11-14",46]
[null,null,null,null,null,null,"2019-11-15",46]
[null,null,null,null,null,null,"2019-11-16",46]
[null,null,null,null,null,null,"2019-11-17",46]
[null,null,null,null,null,null,"2019-11-18",47]
[null,null,null,null,null,null,"2019-11-19",47]
[null,null,null,null,null,null,"2019-11-20",47]
[null,null,null,null,null,null,"2019-11-21",47]
[null,null,null,null,null,null,"2019-11-22",47]
[null,null,null,null,null,null,"2019-11-23",47]
[null,null,null,null,null,null,"2019-11-24",47]
[null,null,null,null,null,null,"2019-11-25",48]
[null,null,null,null,null,null,"2019-11-26",48]
[null,null,null,null,null,null,"2019-11-27",48]
[null,null,null,null,null,null,"2019-11-28",48]
[null,null,null,null,null,null,"2019-11-29",48]
[null,null,null,null,null,null,"2019-11-30",48]
[null,null,null,null,null,null,"2019-12-01",48]
[null,null,null,null,null,null,"2019-12-02",49]
[null,null,null,null,null,null,"2019-12-03",49]
[null,null,null,null,null,null,"2019-12-04",49]
[null,null,null,null,null,null,"2019-12-05",49]
[null,null,null,null,null,null,"2019-12-06",49]
[null,null,null,null,null,null,"2019-12-07",49]
[null,null,null,null,null,null,"2019-12-08",49]
[null,null,null,null,null,null,"2019-12-09",50]
[null,null,null,null,null,null,"2019-12-10",50]
[null,null,null,null,null,null,"2019-12-11",50]
[null,null,null,null,null,null,"2019-12-12",50]
[null,null,null,null,null,null,"2019-12-13",50]
[null,null,null,null,null,null,"2019-12-14",50]
[null,null,null,null,null,null,"2019-12-15",50]
[null,null,null,null,null,null,"2019-12-16",51]
[null,null,null,null,null,null,"2019-12-17",51]
[null,null,null,null,null,null,"2019-12-18",51]
[null,null,null,null,null,null,"2019-12-19",51]
[null,null,null,null,null,null,"2019-12-20",51]
[null,null,null,null,null,null,"2019-12-21",51]
[null,null,null,null,null,null,"2019-12-22",51]
[null,null,null,null,null,null,"2019-12-23",52]
[null,null,null,null,null,null,"2019-12-24",52]
[null,null,null,null,null,null,"2019-12-25",52]
[null,null,null,null,null,null,"2019-12-26",52]
[null,null,null,null,null,null,"2019-12-27",52]
[null,null,null,null,null,null,"2019-12-28",52]
[null,null,null,null,null,null,"2019-12-29",52]
[null,null,null,null,null,null,"2019-12-30",1]
[null,null,null,null,null,null,"2019-12-31",1]
[null,null,null,null,null,null,"2020-01-01",1]
[null,null,null,null,null,null,"2020-01-02",1]
[null,null,null,null,null,null,"2020-01-03",1]
[null,null,null,null,null,null,"2020-01-04",1]
[null,null,null,null,null,null,"2020-01-05",1]
[null,null,null,null,null,null,"2020-01-06",2]
[null,null,null,null,null,null,"2020-01-07",2]
[null,null,null,null,null,null,"2020-01-08",2]
[null,null,null,null,null,null,"2020-01-09",2]
[null,null,null,null,null,null,"2020-01-10",2]
[null,null,null,null,null,null,"2020-01-11",2]
[null,null,null,null,null,null,"2020-01-12",2]
[null,null,null,null,null,null,"2020-01-13",3]
[null,null,null,null,null,null,"2020-01-14",3]
[null,null,null,null,null,null,"2020-01-15",3]
[null,null,null,null,null,null,"2020-01-16",3]
[null,null,null,null,null,null,"2020-01-17",3]
[null,null,null,null,null,null,"2020-01-18",3]
[null,null,null,null,null,null,"2020-01-19",3]
[null,null,null,null,null,null,"2020-01-20",4]
[null,null,null,null,null,null,"2020-01-21",4]
[null,null,null,null,null,null,"2020-01-22",4]
[null,null,null,null,null,null,"2020-01-23",4]
[null,null,null,null,null,null,"2020-01-24",4]
[null,null,null,null,null,null,"2020-01-25",4]
[null,null,null,null,null,null,"2020-01-26",4]
[null,null,null,null,null,null,"2020-01-27",5]
[null,null,null,null,null,null,"2020-01-28",5]
[null,null,null,null,null,null,"2020-01-29",5]
[null,null,null,null,null,null,"2020-01-30",5]
[null,null,null,null,null,null,"2020-01-31",5]
[null,null,null,null,null,null,"2020-02-01",5]
[null,null,null,null,null,null,"2020-02-02",5]
[null,null,null,null,null,null,"2020-02-03",6]
[null,null,null,null,null,null,"2020-02-04",6]
[null,null,null,null,null,null,"2020-02-05",6]
[null,null,null,null,null,null,"2020-02-06",6]
[null,null,null,null,null,null,"2020-02-07",6]
[null,null,null,null,null,null,"2020-02-08",6]
[null,null,null,null,null,null,"2020-02-09",6]
[null,null,null,null,null,null,"2020-02-10",7]
[null,null,null,null,null,null,"2020-02-11",7]
[null,null,null,null,null,null,"2020-02-12",7]
[null,null,null,null,null,null,"2020-02-13",7]
[null,null,null,null,null,null,"2020-02-14",7]
[null,null,null,null,null,null,"2020-02-15",7]
[null,null,null,null,null,null,"2020-02-16",7]
[null,null,null,null,null,null,"2020-02-17",8]
[null,null,null,null,null,null,"2020-02-18",8]
[null,null,null,null,null,null,"2020-02-19",8]
[null,null,null,null,null,null,"2020-02-20",8]
[null,null,null,null,null,null,"2020-02-21",8]
[null,null,null,null,null,null,"2020-02-22",8]
[null,null,null,null,null,null,"2020-02-23",8]
[null,null,null,null,null,null,"2020-02-24",9]
[null,null,null,null,null,null,"2020-02-25",9]
[null,null,null,null,null,null,"2020-02-26",9]
[null,null,null,null,null,null,"2020-02-27",9]
[null,null,null,null,null,null,"2020-02-28",9]
[null,null,null,null,null,null,"2020-02-29",9]
[null,null,null,null,null,null,"2020-03-01",9]
[null,null,null,null,null,null,"2020-03-02",10]
[null,null,null,null,null,null,"2020-03-03",10]
[null,null,null,null,null,null,"2020-03-04",10]
[null,null,null,null,null,null,"2020-03-05",10]
[null,null,null,null,null,null,"2020-03-06",10]
[null,null,null,null,null,null,"2020-03-07",10]
[null,null,null,null,null,null,"2020-03-08",10]
[null,null,null,null,null,null,"2020-03-09",11]
[null,null,null,null,null,null,"2020-03-10",11]
[null,null,null,null,null,null,"2020-03-11",11]
[null,null,null,null,null,null,"2020-03-12",11]
[null,null,null,null,null,null,"2020-03-13",11]
[null,null,null,null,null,null,"2020-03-14",11]
[null,null,null,null,null,null,"2020-03-15",11]
[null,null,null,null,null,null,"2020-03-16",12]
[null,null,null,null,null,null,"2020-03-17",12]
[null,null,null,null,null,null,"2020-03-18",12]
[null,null,null,null,null,null,"2020-03-19",12]
[null,null,null,null,null,null,"2020-03-20",12]
[null,null,null,null,null,null,"2020-03-21",12]
[null,null,null,null,null,null,"2020-03-22",12]
[null,null,null,null,null,null,"2020-03-23",13]
[null,null,null,null,null,null,"2020-03-24",13]
[null,null,null,null,null,null,"2020-03-25",13]
[null,null,null,null,null,null,"2020-03-26",13]
[null,null,null,null,null,null,"2020-03-27",13]
[null,null,null,null,null,null,"2020-03-28",13]
[null,null,null,null,null,null,"2020-03-29",13]
[null,null,null,null,null,null,"2020-03-30",14]
[null,null,null,null,null,null,"2020-03-31",14]
[null,null,null,null,null,null,"2020-04-01",14]
[null,null,null,null,null,null,"2020-04-02",14]
[null,null,null,null,null,null,"2020-04-03",14]
[null,null,null,null,null,null,"2020-04-04",14]
[null,null,null,null,null,null,"2020-04-05",14]
[null,null,null,null,null,null,"2020-04-06",15]
[null,null,null,null,null,null,"2020-04-07",15]
[null,null,null,null,null,null,"2020-04-08",15]
[null,null,null,null,null,null,"2020-04-09",15]
[null,null,null,null,null,null,"2020-04-10",15]
[null,null,null,null,null,null,"2020-04-11",15]
[null,null,null,null,null,null,"2020-04-12",15]
[null,null,null,null,null,null,"2020-04-13",16]
[null,null,null,null,null,null,"2020-04-14",16]
[null,null,null,null,null,null,"2020-04-15",16]
[null,null,null,null,null,null,"2020-04-16",16]
[null,null,null,null,null,null,"2020-04-17",16]
[null,null,null,null,null,null,"2020-04-18",16]
[null,null,null,null,null,null,"2020-04-19",16]
[null,null,null,null,null,null,"2020-04-20",17]
[null,null,null,null,null,null,"2020-04-21",17]
[null,null,null,null,null,null,"2020-04-22",17]
[null,null,null,null,null,null,"2020-04-23",17]
[null,null,null,null,null,null,"2020-04-24",17]
[null,null,null,null,null,null,"2020-04-25",17]
[null,null,null,null,null,null,"2020-04-26",17]
[null,null,null,null,null,null,"2020-04-27",18]
[null,null,null,null,null,null,"2020-04-28",18]
[null,null,null,null,null,null,"2020-04-29",18]
[null,null,null,null,null,null,"2020-04-30",18]
[null,null,null,null,null,null,"2020-05-01",18]
[null,null,null,null,null,null,"2020-05-02",18]
[null,null,null,null,null,null,"2020-05-03",18]
[null,null,null,null,null,null,"2020-05-04",19]
[null,null,null,null,null,null,"2020-05-05",19]
[null,null,null,null,null,null,"2020-05-06",19]
[null,null,null,null,null,null,"2020-05-07",19]
[null,null,null,null,null,null,"2020-05-08",19]
[null,null,null,null,null,null,"2020-05-09",19]
[null,null,null,null,null,null,"2020-05-10",19]
[null,null,null,null,null,null,"2020-05-11",20]
[null,null,null,null,null,null,"2020-05-12",20]
[null,null,null,null,null,null,"2020-05-13",20]
[null,null,null,null,null,null,"2020-05-14",20]
[null,null,null,null,null,null,"2020-05-15",20]
[null,null,null,null,null,null,"2020-05-16",20]
[null,null,null,null,null,null,"2020-05-17",20]
[null,null,null,null,null,null,"2020-05-18",21]
[null,null,null,null,null,null,"2020-05-19",21]
[null,null,null,null,null,null,"2020-05-20",21]
[null,null,null,null,null,null,"2020-05-21",21]
[null,null,null,null,null,null,"2020-05-22",21]
[null,null,null,null,null,null,"2020-05-23",21]
[null,null,null,null,null,null,"2020-05-24",21]
[null,null,null,null,null,null,"2020-05-25",22]
[null,null,null,null,null,null,"2020-05-26",22]
[null,null,null,null,null,null,"2020-05-27",22]
[null,null,null,null,null,null,"2020-05-28",22]
[null,null,null,null,null,null,"2020-05-29",22]
[null,null,null,null,null,null,"2020-05-30",22]
[null,null,null,null,null,null,"2020-05-31",22]
[null,null,null,null,null,null,"2020-06-01",23]
[null,null,null,null,null,null,"2020-06-02",23]
[null,null,null,null,null,null,"2020-06-03",23]
[null,null,null,null,null,null,"2020-06-04",23]
[null,null,null,null,null,null,"2020-06-05",23]
[null,null,null,null,null,null,"2020-06-06",23]
[null,null,null,null,null,null,"2020-06-07",23]
[null,null,null,null,null,null,"2020-06-08",24]
[null,null,null,null,null,null,"2020-06-09",24]
[null,null,null,null,null,null,"2020-06-10",24]
[null,null,null,null,null,null,"2020-06-11",24]
[null,null,null,null,null,null,"2020-06-12",24]
[null,null,null,null,null,null,"2020-06-13",24]
[null,null,null,null,null,null,"2020-06-14",24]
[null,null,null,null,null,null,"2020-06-15",25]
[null,null,null,null,null,null,"2020-06-16",25]
[null,null,null,null,null,null,"2020-06-17",25]
[null,null,null,null,null,null,"2020-06-18",25]
[null,null,null,null,null,null,"2020-06-19",25]
[null,null,null,null,null,null,"2020-06-20",25]
[null,null,null,null,null,null,"2020-06-21",25]
[null,null,null,null,null,null,"2020-06-22",26]
[null,null,null,null,null,null,"2020-06-23",26]
[null,null,null,null,null,null,"2020-06-24",26]
[null,null,null,null,null,null,"2020-06-25",26]
[null,null,null,null,null,null,"2020-06-26",26]
[null,null,null,null,null,null,"2020-06-27",26]
[null,null,null,null,null,null,"2020-06-28",26]
[null,null,null,null,null,null,"2020-06-29",27]
[null,null,null,null,null,null,"2020-06-30",27]
[null,null,null,null,null,null,"2020-07-01",27]
[null,null,null,null,null,null,"2020-07-02",27]
[null,null,null,null,null,null,"2020-07-03",27]
[null,null,null,null,null,null,"2020-07-04",27]
[null,null,null,null,null,null,"2020-07-05",27]
[null,null,null,null,null,null,"2020-07-06",28]
[null,null,null,null,null,null,"2020-07-07",28]
[null,null,null,null,null,null,"2020-07-08",28]
[null,null,null,null,null,null,"2020-07-09",28]
[null,null,null,null,null,null,"2020-07-10",28]
[null,null,null,null,null,null,"2020-07-11",28]
[null,null,null,null,null,null,"2020-07-12",28]
[null,null,null,null,null,null,"2020-07-13",29]
[null,null,null,null,null,null,"2020-07-14",29]
[null,null,null,null,null,null,"2020-07-15",29]
[null,null,null,null,null,null,"2020-07-16",29]
[null,null,null,null,null,null,"2020-07-17",29]
[null,null,null,null,null,null,"2020-07-18",29]
[null,null,null,null,null,null,"2020-07-19",29]
[null,null,null,null,null,null,"2020-07-20",30]
[null,null,null,null,null,null,"2020-07-21",30]
[null,null,null,null,null,null,"2020-07-22",30]
[null,null,null,null,null,null,"2020-07-23",30]
[null,null,null,null,null,null,"2020-07-24",30]
[null,null,null,null,null,null,"2020-07-25",30]
[null,null,null,null,null,null,"2020-07-26",30]
[null,null,null,null,null,null,"2020-07-27",31]
[null,null,null,null,null,null,"2020-07-28",31]
[null,null,null,null,null,null,"2020-07-29",31]
[null,null,null,null,null,null,"2020-07-30",31]
[null,null,null,null,null,null,"2020-07-31",31]
[null,null,null,null,null,null,"2020-08-01",31]
[null,null,null,null,null,null,"2020-08-02",31]
[null,null,null,null,null,null,"2020-08-03",32]
[null,null,null,null,null,null,"2020-08-04",32]
[null,null,null,null,null,null,"2020-08-05",32]
[null,null,null,null,null,null,"2020-08-06",32]
[null,null,null,null,null,null,"2020-08-07",32]
[null,null,null,null,null,null,"2020-08-08",32]
[null,null,null,null,null,null,"2020-08-09",32]
[null,null,null,null,null,null,"2020-08-10",33]
[null,null,null,null,null,null,"2020-08-11",33]
[null,null,null,null,null,null,"2020-08-12",33]
[null,null,null,null,null,null,"2020-08-13",33]
[null,null,null,null,null,null,"2020-08-14",33]
[null,null,null,null,null,null,"2020-08-15",33]
[null,null,null,null,null,null,"2020-08-16",33]
[null,null,null,null,null,null,"2020-08-17",34]
[null,null,null,null,null,null,"2020-08-18",34]
[null,null,null,null,null,null,"2020-08-19",34]
[null,null,null,null,null,null,"2020-08-20",34]
[null,null,null,null,null,null,"2020-08-21",34]
[null,null,null,null,null,null,"2020-08-22",34]
[null,null,null,null,null,null,"2020-08-23",34]
[null,null,null,null,null,null,"2020-08-24",35]
[null,null,null,null,null,null,"2020-08-25",35]
[null,null,null,null,null,null,"2020-08-26",35]
[null,null,null,null,null,null,"2020-08-27",35]
[null,null,null,null,null,null,"2020-08-28",35]
[null,null,null,null,null,null,"2020-08-29",35]
[null,null,null,null,null,null,"2020-08-30",35]
[null,null,null,null,null,null,"2020-08-31",36]
[null,null,null,null,null,null,"2020-09-01",36]
[null,null,null,null,null,null,"2020-09-02",36]
[null,null,null,null,null,null,"2020-09-03",36]
[null,null,null,null,null,null,"2020-09-04",36]
[null,null,null,null,null,null,"2020-09-05",36]
[null,null,null,null,null,null,"2020-09-06",36]
[null,null,null,null,null,null,"2020-09-07",37]
[null,null,null,null,null,null,"2020-09-08",37]
[null,null,null,null,null,null,"2020-09-09",37]
[null,null,null,null,null,null,"2020-09-10",37]
[null,null,null,null,null,null,"2020-09-11",37]
[null,null,null,null,null,null,"2020-09-12",37]
[null,null,null,null,null,null,"2020-09-13",37]
[null,null,null,null,null,null,"2020-09-14",38]
[null,null,null,null,null,null,"2020-09-15",38]
[null,null,null,null,null,null,"2020-09-16",38]
[null,null,null,null,null,null,"2020-09-17",38]
[null,null,null,null,null,null,"2020-09-18",38]
[null,null,null,null,null,null,"2020-09-19",38]
[null,null,null,null,null,null,"2020-09-20",38]
[null,null,null,null,null,null,"2020-09-21",39]
[null,null,null,null,null,null,"2020-09-22",39]
[null,null,null,null,null,null,"2020-09-23",39]
[null,null,null,null,null,null,"2020-09-24",39]
[null,null,null,null,null,null,"2020-09-25",39]
[null,null,null,null,null,null,"2020-09-26",39]
[null,null,null,null,null,null,"2020-09-27",39]
[null,null,null,null,null,null,"2020-09-28",40]
[null,null,null,null,null,null,"2020-09-29",40]
[null,null,null,null,null,null,"2020-09-30",40]
[null,null,null,null,null,null,"2020-10-01",40]
[null,null,null,null,null,null,"2020-10-02",40]
[null,null,null,null,null,null,"2020-10-03",40]
[null,null,null,null,null,null,"2020-10-04",40]
[null,null,null,null,null,null,"2020-10-05",41]
[null,null,null,null,null,null,"2020-10-06",41]
[null,null,null,null,null,null,"2020-10-07",41]
[null,null,null,null,null,null,"2020-10-08",41]
[null,null,null,null,null,null,"2020-10-09",41]
[null,null,null,null,null,null,"2020-10-10",41]
[null,null,null,null,null,null,"2020-10-11",41]
[null,null,null,null,null,null,"2020-10-12",42]
[null,null,null,null,null,null,"2020-10-13",42]
[null,null,null,null,null,null,"2020-10-14",42]
[null,null,null,null,null,null,"2020-10-15",42]
[null,null,null,null,null,null,"2020-10-16",42]
[null,null,null,null,null,null,"2020-10-17",42]
[null,null,null,null,null,null,"2020-10-18",42]
[null,null,null,null,null,null,"2020-10-19",43]
[null,null,null,null,null,null,"2020-10-20",43]
[null,null,null,null,null,null,"2020-10-21",43]
[null,null,null,null,null,null,"2020-10-22",43]
[null,null,null,null,null,null,"2020-10-23",43]
[null,null,null,null,null,null,"2020-10-24",43]
[null,null,null,null,null,null,"2020-10-25",43]
[null,null,null,null,null,null,"2020-10-26",44]
[null,null,null,null,null,null,"2020-10-27",44]
[null,null,null,null,null,null,"2020-10-28",44]
[null,null,null,null,null,null,"2020-10-29",44]
[null,null,null,null,null,null,"2020-10-30",44]
[null,null,null,null,null,null,"2020-10-31",44]
[null,null,null,null,null,null,"2020-11-01",44]
[null,null,null,null,null,null,"2020-11-02",45]
[null,null,null,null,null,null,"2020-11-03",45]
[null,null,null,null,null,null,"2020-11-04",45]
[null,null,null,null,null,null,"2020-11-05",45]
[null,null,null,null,null,null,"2020-11-06",45]
[null,null,null,null,null,null,"2020-11-07",45]
[null,null,null,null,null,null,"2020-11-08",45]
[null,null,null,null,null,null,"2020-11-09",46]
[null,null,null,null,null,null,"2020-11-10",46]
[null,null,null,null,null,null,"2020-11-11",46]
[null,null,null,null,null,null,"2020-11-12",46]
[null,null,null,null,null,null,"2020-11-13",46]
[null,null,null,null,null,null,"2020-11-14",46]
[null,null,null,null,null,null,"2020-11-15",46]
[null,null,null,null,null,null,"2020-11-16",47]
[null,null,null,null,null,null,"2020-11-17",47]
[null,null,null,null,null,null,"2020-11-18",47]
[null,null,null,null,null,null,"2020-11-19",47]
[null,null,null,null,null,null,"2020-11-20",47]
[null,null,null,null,null,null,"2020-11-21",47]
[null,null,null,null,null,null,"2020-11-22",47]
[null,null,null,null,null,null,"2020-11-23",48]
[null,null,null,null,null,null,"2020-11-24",48]
[null,null,null,null,null,null,"2020-11-25",48]
[null,null,null,null,null,null,"2020-11-26",48]
[null,null,null,null,null,null,"2020-11-27",48]
[null,null,null,null,null,null,"2020-11-28",48]
[null,null,null,null,null,null,"2020-11-29",48]
[null,null,null,null,null,null,"2020-11-30",49]
[null,null,null,null,null,null,"2020-12-01",49]
[null,null,null,null,null,null,"2020-12-02",49]
[null,null,null,null,null,null,"2020-12-03",49]
[null,null,null,null,null,null,"2020-12-04",49]
[null,null,null,null,null,null,"2020-12-05",49]
[null,null,null,null,null,null,"2020-12-06",49]
[null,null,null,null,null,null,"2020-12-07",50]
[null,null,null,null,null,null,"2020-12-08",50]
[null,null,null,null,null,null,"2020-12-09",50]
[null,null,null,null,null,null,"2020-12-10",50]
[null,null,null,null,null,null,"2020-12-11",50]
[null,null,null,null,null,null,"2020-12-12",50]
[null,null,null,null,null,null,"2020-12-13",50]
[null,null,null,null,null,null,"2020-12-14",51]
[null,null,null,null,null,null,"2020-12-15",51]
[null,null,null,null,null,null,"2020-12-16",51]
[null,null,null,null,null,null,"2020-12-17",51]
[null,null,null,null,null,null,"2020-12-18",51]
[null,null,null,null,null,null,"2020-12-19",51]
[null,null,null,null,null,null,"2020-12-20",51]
[null,null,null,null,null,null,"2020-12-21",52]
[null,null,null,null,null,null,"2020-12-22",52]
[null,null,null,null,null,null,"2020-12-23",52]
[null,null,null,null,null,null,"2020-12-24",52]
[null,null,null,null,null,null,"2020-12-25",52]
[null,null,null,null,null,null,"2020-12-26",52]
[null,null,null,null,null,null,"2020-12-27",52]
[null,null,null,null,null,null,"2020-12-28",53]
[null,null,null,null,null,null,"2020-12-29",53]
[null,null,null,null,null,null,"2020-12-30",53]
[null,null,null,null,null,null,"2020-12-31",53]
[null,null,null,null,null,null,"2021-01-01",53]
[null,null,null,null,null,null,"2021-01-02",53]
[null,null,null,null,null,null,"2021-01-03",53]
[null,null,null,null,null,null,"2021-01-04",1]
[null,null,null,null,null,null,"2021-01-05",1]
[null,null,null,null,null,null,"2021-01-06",1]
[null,null,null,null,null,null,"2021-01-07",1]
[null,null,null,null,null,null,"2021-01-08",1]
[null,null,null,null,null,null,"2021-01-09",1]
[null,null,null,null,null,null,"2021-01-10",1]
[null,null,null,null,null,null,"2021-01-11",2]
[null,null,null,null,null,null,"2021-01-12",2]
[null,null,null,null,null,null,"2021-01-13",2]
[null,null,null,null,null,null,"2021-01-14",2]
[null,null,null,null,null,null,"2021-01-15",2]
[null,null,null,null,null,null,"2021-01-16",2]
[null,null,null,null,null,null,"2021-01-17",2]
[null,null,null,null,null,null,"2021-01-18",3]
[null,null,null,null,null,null,"2021-01-19",3]
[null,null,null,null,null,null,"2021-01-20",3]
[null,null,null,null,null,null,"2021-01-21",3]
[null,null,null,null,null,null,"2021-01-22",3]
[null,null,null,null,null,null,"2021-01-23",3]
[null,null,null,null,null,null,"2021-01-24",3]
[null,null,null,null,null,null,"2021-01-25",4]
[null,null,null,null,null,null,"2021-01-26",4]
[null,null,null,null,null,null,"2021-01-27",4]
[null,null,null,null,null,null,"2021-01-28",4]
[null,null,null,null,null,null,"2021-01-29",4]
[null,null,null,null,null,null,"2021-01-30",4]
[null,null,null,null,null,null,"2021-01-31",4]
[null,null,null,null,null,null,"2021-02-01",5]
[null,null,null,null,null,null,"2021-02-02",5]
[null,null,null,null,null,null,"2021-02-03",5]
[null,null,null,null,null,null,"2021-02-04",5]
[null,null,null,null,null,null,"2021-02-05",5]
[null,null,null,null,null,null,"2021-02-06",5]
[null,null,null,null,null,null,"2021-02-07",5]
[null,null,null,null,null,null,"2021-02-08",6]
[null,null,null,null,null,null,"2021-02-09",6]
[null,null,null,null,null,null,"2021-02-10",6]
[null,null,null,null,null,null,"2021-02-11",6]
[null,null,null,null,null,null,"2021-02-12",6]
[null,null,null,null,null,null,"2021-02-13",6]
[null,null,null,null,null,null,"2021-02-14",6]
[null,null,null,null,null,null,"2021-02-15",7]
[null,null,null,null,null,null,"2021-02-16",7]
[null,null,null,null,null,null,"2021-02-17",7]
[null,null,null,null,null,null,"2021-02-18",7]
[null,null,null,null,null,null,"2021-02-19",7]
[null,null,null,null,null,null,"2021-02-20",7]
[null,null,null,null,null,null,"2021-02-21",7]
[null,null,null,null,null,null,"2021-02-22",8]
[null,null,null,null,null,null,"2021-02-23",8]
[null,null,null,null,null,null,"2021-02-24",8]
[null,null,null,null,null,null,"2021-02-25",8]
[null,null,null,null,null,null,"2021-02-26",8]
[null,null,null,null,null,null,"2021-02-27",8]
[null,null,null,null,null,null,"2021-02-28",8]
[null,null,null,null,null,null,"2021-03-01",9]
[null,null,null,null,null,null,"2021-03-02",9]
[null,null,null,null,null,null,"2021-03-03",9]
[null,null,null,null,null,null,"2021-03-04",9]
[null,null,null,null,null,null,"2021-03-05",9]
[null,null,null,null,null,null,"2021-03-06",9]
[null,null,null,null,null,null,"2021-03-07",9]
[null,null,null,null,null,null,"2021-03-08",10]
[null,null,null,null,null,null,"2021-03-09",10]
[null,null,null,null,null,null,"2021-03-10",10]
[null,null,null,null,null,null,"2021-03-11",10]
[null,null,null,null,null,null,"2021-03-12",10]
[null,null,null,null,null,null,"2021-03-13",10]
[null,null,null,null,null,null,"2021-03-14",10]
[null,null,null,null,null,null,"2021-03-15",11]
[null,null,null,null,null,null,"2021-03-16",11]
[null,null,null,null,null,null,"2021-03-17",11]
[null,null,null,null,null,null,"2021-03-18",11]
[null,null,null,null,null,null,"2021-03-19",11]
[null,null,null,null,null,null,"2021-03-20",11]
[null,null,null,null,null,null,"2021-03-21",11]
[null,null,null,null,null,null,"2021-03-22",12]
[null,null,null,null,null,null,"2021-03-23",12]
[null,null,null,null,null,null,"2021-03-24",12]
[null,null,null,null,null,null,"2021-03-25",12]
[null,null,null,null,null,null,"2021-03-26",12]
[null,null,null,null,null,null,"2021-03-27",12]
[null,null,null,null,null,null,"2021-03-28",12]
[null,null,null,null,null,null,"2021-03-29",13]
[null,null,null,null,null,null,"2021-03-30",13]
[null,null,null,null,null,null,"2021-03-31",13]
[null,null,null,null,null,null,"2021-04-01",13]
[null,null,null,null,null,null,"2021-04-02",13]
[null,null,null,null,null,null,"2021-04-03",13]
[null,null,null,null,null,null,"2021-04-04",13]
[null,null,null,null,null,null,"2021-04-05",14]
[null,null,null,null,null,null,"2021-04-06",14]
[null,null,null,null,null,null,"2021-04-07",14]
[null,null,null,null,null,null,"2021-04-08",14]
[null,null,null,null,null,null,"2021-04-09",14]
[null,null,null,null,null,null,"2021-04-10",14]
[null,null,null,null,null,null,"2021-04-11",14]
[null,null,null,null,null,null,"2021-04-12",15]
[null,null,null,null,null,null,"2021-04-13",15]
[null,null,null,null,null,null,"2021-04-14",15]
[null,null,null,null,null,null,"2021-04-15",15]
[null,null,null,null,null,null,"2021-04-16",15]
[null,null,null,null,null,null,"2021-04-17",15]
[null,null,null,null,null,null,"2021-04-18",15]
[null,null,null,null,null,null,"2021-04-19",16]
[null,null,null,null,null,null,"2021-04-20",16]
[null,null,null,null,null,null,"2021-04-21",16]
[null,null,null,null,null,null,"2021-04-22",16]
[null,null,null,null,null,null,"2021-04-23",16]
[null,null,null,null,null,null,"2021-04-24",16]
[null,null,null,null,null,null,"2021-04-25",16]
[null,null,null,null,null,null,"2021-04-26",17]
[null,null,null,null,null,null,"2021-04-27",17]
[null,null,null,null,null,null,"2021-04-28",17]
[null,null,null,null,null,null,"2021-04-29",17]
[null,null,null,null,null,null,"2021-04-30",17]
[null,null,null,null,null,null,"2021-05-01",17]
[null,null,null,null,null,null,"2021-05-02",17]
[null,null,null,null,null,null,"2021-05-03",18]
[null,null,null,null,null,null,"2021-05-04",18]
[null,null,null,null,null,null,"2021-05-05",18]
[null,null,null,null,null,null,"2021-05-06",18]
[null,null,null,null,null,null,"2021-05-07",18]
[null,null,null,null,null,null,"2021-05-08",18]
[null,null,null,null,null,null,"2021-05-09",18]
[null,null,null,null,null,null,"2021-05-10",19]
[null,null,null,null,null,null,"2021-05-11",19]
[null,null,null,null,null,null,"2021-05-12",19]
[null,null,null,null,null,null,"2021-05-13",19]
[null,null,null,null,null,null,"2021-05-14",19]
[null,null,null,null,null,null,"2021-05-15",19]
[null,null,null,null,null,null,"2021-05-16",19]
[null,null,null,null,null,null,"2021-05-17",20]
[null,null,null,null,null,null,"2021-05-18",20]
[null,null,null,null,null,null,"2021-05-19",20]
[null,null,null,null,null,null,"2021-05-20",20]
[null,null,null,null,null,null,"2021-05-21",20]
[null,null,null,null,null,null,"2021-05-22",20]
[null,null,null,null,null,null,"2021-05-23",20]
[null,null,null,null,null,null,"2021-05-24",21]
[null,null,null,null,null,null,"2021-05-25",21]
[null,null,null,null,null,null,"2021-05-26",21]
[null,null,null,null,null,null,"2021-05-27",21]
[null,null,null,null,null,null,"2021-05-28",21]
[null,null,null,null,null,null,"2021-05-29",21]
[null,null,null,null,null,null,"2021-05-30",21]
[null,null,null,null,null,null,"2021-05-31",22]
[null,null,null,null,null,null,"2021-06-01",22]
[null,null,null,null,null,null,"2021-06-02",22]
[null,null,null,null,null,null,"2021-06-03",22]
[null,null,null,null,null,null,"2021-06-04",22]
[null,null,null,null,null,null,"2021-06-05",22]
[null,null,null,null,null,null,"2021-06-06",22]
[null,null,null,null,null,null,"2021-06-07",23]
[null,null,null,null,null,null,"2021-06-08",23]
[null,null,null,null,null,null,"2021-06-09",23]
[null,null,null,null,null,null,"2021-06-10",23]
[null,null,null,null,null,null,"2021-06-11",23]
[null,null,null,null,null,null,"2021-06-12",23]
[null,null,null,null,null,null,"2021-06-13",23]
[null,null,null,null,null,null,"2021-06-14",24]
[null,null,null,null,null,null,"2021-06-15",24]
[null,null,null,null,null,null,"2021-06-16",24]
[null,null,null,null,null,null,"2021-06-17",24]
[null,null,null,null,null,null,"2021-06-18",24]
[null,null,null,null,null,null,"2021-06-19",24]
[null,null,null,null,null,null,"2021-06-20",24]
[null,null,null,null,null,null,"2021-06-21",25]
[null,null,null,null,null,null,"2021-06-22",25]
[null,null,null,null,null,null,"2021-06-23",25]
[null,null,null,null,null,null,"2021-06-24",25]
[null,null,null,null,null,null,"2021-06-25",25]
[null,null,null,null,null,null,"2021-06-26",25]
[null,null,null,null,null,null,"2021-06-27",25]
[null,null,null,null,null,null,"2021-06-28",26]
[null,null,null,null,null,null,"2021-06-29",26]
[null,null,null,null,null,null,"2021-06-30",26]
[null,null,null,null,null,null,"2021-07-01",26]
[null,null,null,null,null,null,"2021-07-02",26]
[null,null,null,null,null,null,"2021-07-03",26]
[null,null,null,null,null,null,"2021-07-04",26]
[null,null,null,null,null,null,"2021-07-05",27]
[null,null,null,null,null,null,"2021-07-06",27]
[null,null,null,null,null,null,"2021-07-07",27]
[null,null,null,null,null,null,"2021-07-08",27]
[null,null,null,null,null,null,"2021-07-09",27]
[null,null,null,null,null,null,"2021-07-10",27]
[null,null,null,null,null,null,"2021-07-11",27]
[null,null,null,null,null,null,"2021-07-12",28]
[null,null,null,null,null,null,"2021-07-13",28]
[null,null,null,null,null,null,"2021-07-14",28]
[null,null,null,null,null,null,"2021-07-15",28]
[null,null,null,null,null,null,"2021-07-16",28]
[null,null,null,null,null,null,"2021-07-17",28]
[null,null,null,null,null,null,"2021-07-18",28]
[null,null,null,null,null,null,"2021-07-19",29]
[null,null,null,null,null,null,"2021-07-20",29]
[null,null,null,null,null,null,"2021-07-21",29]
[null,null,null,null,null,null,"2021-07-22",29]
[null,null,null,null,null,null,"2021-07-23",29]
[null,null,null,null,null,null,"2021-07-24",29]
[null,null,null,null,null,null,"2021-07-25",29]
[null,null,null,null,null,null,"2021-07-26",30]
[null,null,null,null,null,null,"2021-07-27",30]
[null,null,null,null,null,null,"2021-07-28",30]
[null,null,null,null,null,null,"2021-07-29",30]
[null,null,null,null,null,null,"2021-07-30",30]
[null,null,null,null,null,null,"2021-07-31",30]
[null,null,null,null,null,null,"2021-08-01",30]
[null,null,null,null,null,null,"2021-08-02",31]
[null,null,null,null,null,null,"2021-08-03",31]
[null,null,null,null,null,null,"2021-08-04",31]
[null,null,null,null,null,null,"2021-08-05",31]
[null,null,null,null,null,null,"2021-08-06",31]
[null,null,null,null,null,null,"2021-08-07",31]
[null,null,null,null,null,null,"2021-08-08",31]
[null,null,null,null,null,null,"2021-08-09",32]
[null,null,null,null,null,null,"2021-08-10",32]
[null,null,null,null,null,null,"2021-08-11",32]
[null,null,null,null,null,null,"2021-08-12",32]
[null,null,null,null,null,null,"2021-08-13",32]
[null,null,null,null,null,null,"2021-08-14",32]
[null,null,null,null,null,null,"2021-08-15",32]
[null,null,null,null,null,null,"2021-08-16",33]
[null,null,null,null,null,null,"2021-08-17",33]
[null,null,null,null,null,null,"2021-08-18",33]
[null,null,null,null,null,null,"2021-08-19",33]
[null,null,null,null,null,null,"2021-08-20",33]
[null,null,null,null,null,null,"2021-08-21",33]
[null,null,null,null,null,null,"2021-08-22",33]
[null,null,null,null,null,null,"2021-08-23",34]
[null,null,null,null,null,null,"2021-08-24",34]
[null,null,null,null,null,null,"2021-08-25",34]
[null,null,null,null,null,null,"2021-08-26",34]
[null,null,null,null,null,null,"2021-08-27",34]
[null,null,null,null,null,null,"2021-08-28",34]
[null,null,null,null,null,null,"2021-08-29",34]
[null,null,null,null,null,null,"2021-08-30",35]
[null,null,null,null,null,null,"2021-08-31",35]
[null,null,null,null,null,null,"2021-09-01",35]
[null,null,null,null,null,null,"2021-09-02",35]
[null,null,null,null,null,null,"2021-09-03",35]
[null,null,null,null,null,null,"2021-09-04",35]
[null,null,null,null,null,null,"2021-09-05",35]
[null,null,null,null,null,null,"2021-09-06",36]
[null,null,null,null,null,null,"2021-09-07",36]
[null,null,null,null,null,null,"2021-09-08",36]
[null,null,null,null,null,null,"2021-09-09",36]
[null,null,null,null,null,null,"2021-09-10",36]
[null,null,null,null,null,null,"2021-09-11",36]
[null,null,null,null,null,null,"2021-09-12",36]
[null,null,null,null,null,null,"2021-09-13",37]
[null,null,null,null,null,null,"2021-09-14",37]
[null,null,null,null,null,null,"2021-09-15",37]
[null,null,null,null,null,null,"2021-09-16",37]
[null,null,null,null,null,null,"2021-09-17",37]
[null,null,null,null,null,null,"2021-09-18",37]
[null,null,null,null,null,null,"2021-09-19",37]
[null,null,null,null,null,null,"2021-09-20",38]
[null,null,null,null,null,null,"2021-09-21",38]
[null,null,null,null,null,null,"2021-09-22",38]
[null,null,null,null,null,null,"2021-09-23",38]
[null,null,null,null,null,null,"2021-09-24",38]
[null,null,null,null,null,null,"2021-09-25",38]
[null,null,null,null,null,null,"2021-09-26",38]
[null,null,null,null,null,null,"2021-09-27",39]
[null,null,null,null,null,null,"2021-09-28",39]
[null,null,null,null,null,null,"2021-09-29",39]
[null,null,null,null,null,null,"2021-09-30",39]
[null,null,null,null,null,null,"2021-10-01",39]
[null,null,null,null,null,null,"2021-10-02",39]
[null,null,null,null,null,null,"2021-10-03",39]
[null,null,null,null,null,null,"2021-10-04",40]
[null,null,null,null,null,null,"2021-10-05",40]
[null,null,null,null,null,null,"2021-10-06",40]
[null,null,null,null,null,null,"2021-10-07",40]
[null,null,null,null,null,null,"2021-10-08",40]
[null,null,null,null,null,null,"2021-10-09",40]
[null,null,null,null,null,null,"2021-10-10",40]
[null,null,null,null,null,null,"2021-10-11",41]
[null,null,null,null,null,null,"2021-10-12",41]
[null,null,null,null,null,null,"2021-10-13",41]
[null,null,null,null,null,null,"2021-10-14",41]
[null,null,null,null,null,null,"2021-10-15",41]
[null,null,null,null,null,null,"2021-10-16",41]
[null,null,null,null,null,null,"2021-10-17",41]
[null,null,null,null,null,null,"2021-10-18",42]
[null,null,null,null,null,null,"2021-10-19",42]
[null,null,null,null,null,null,"2021-10-20",42]
[null,null,null,null,null,null,"2021-10-21",42]
[null,null,null,null,null,null,"2021-10-22",42]
[null,null,null,null,null,null,"2021-10-23",42]
[null,null,null,null,null,null,"2021-10-24",42]
[null,null,null,null,null,null,"2021-10-25",43]
[null,null,null,null,null,null,"2021-10-26",43]
[null,null,null,null,null,null,"2021-10-27",43]
[null,null,null,null,null,null,"2021-10-28",43]
[null,null,null,null,null,null,"2021-10-29",43]
[null,null,null,null,null,null,"2021-10-30",43]
[null,null,null,null,null,null,"2021-10-31",43]
[null,null,null,null,null,null,"2021-11-01",44]
[null,null,null,null,null,null,"2021-11-02",44]
[null,null,null,null,null,null,"2021-11-03",44]
[null,null,null,null,null,null,"2021-11-04",44]
[null,null,null,null,null,null,"2021-11-05",44]
[null,null,null,null,null,null,"2021-11-06",44]
[null,null,null,null,null,null,"2021-11-07",44]
[null,null,null,null,null,null,"2021-11-08",45]
[null,null,null,null,null,null,"2021-11-09",45]
[null,null,null,null,null,null,"2021-11-10",45]
[null,null,null,null,null,null,"2021-11-11",45]
[null,null,null,null,null,null,"2021-11-12",45]
[null,null,null,null,null,null,"2021-11-13",45]
[null,null,null,null,null,null,"2021-11-14",45]
[null,null,null,null,null,null,"2021-11-15",46]
[null,null,null,null,null,null,"2021-11-16",46]
[null,null,null,null,null,null,"2021-11-17",46]
[null,null,null,null,null,null,"2021-11-18",46]
[null,null,null,null,null,null,"2021-11-19",46]
[null,null,null,null,null,null,"2021-11-20",46]
[null,null,null,null,null,null,"2021-11-21",46]
[null,null,null,null,null,null,"2021-11-22",47]
[null,null,null,null,null,null,"2021-11-23",47]
[null,null,null,null,null,null,"2021-11-24",47]
[null,null,null,null,null,null,"2021-11-25",47]
[null,null,null,null,null,null,"2021-11-26",47]
[null,null,null,null,null,null,"2021-11-27",47]
[null,null,null,null,null,null,"2021-11-28",47]
[null,null,null,null,null,null,"2021-11-29",48]
[null,null,null,null,null,null,"2021-11-30",48]
[null,null,null,null,null,null,"2021-12-01",48]
[null,null,null,null,null,null,"2021-12-02",48]
[null,null,null,null,null,null,"2021-12-03",48]
[null,null,null,null,null,null,"2021-12-04",48]
[null,null,null,null,null,null,"2021-12-05",48]
[null,null,null,null,null,null,"2021-12-06",49]
[null,null,null,null,null,null,"2021-12-07",49]
[null,null,null,null,null,null,"2021-12-08",49]
[null,null,null,null,null,null,"2021-12-09",49]
[null,null,null,null,null,null,"2021-12-10",49]
[null,null,null,null,null,null,"2021-12-11",49]
[null,null,null,null,null,null,"2021-12-12",49]
[null,null,null,null,null,null,"2021-12-13",50]
[null,null,null,null,null,null,"2021-12-14",50]
[null,null,null,null,null,null,"2021-12-15",50]
[null,null,null,null,null,null,"2021-12-16",50]
[null,null,null,null,null,null,"2021-12-17",50]
[null,null,null,null,null,null,"2021-12-18",50]
[null,null,null,null,null,null,"2021-12-19",50]
[null,null,null,null,null,null,"2021-12-20",51]
[null,null,null,null,null,null,"2021-12-21",51]
[null,null,null,null,null,null,"2021-12-22",51]
[null,null,null,null,null,null,"2021-12-23",51]
[null,null,null,null,null,null,"2021-12-24",51]
[null,null,null,null,null,null,"2021-12-25",51]
[null,null,null,null,null,null,"2021-12-26",51]
[null,null,null,null,null,null,"2021-12-27",52]
[null,null,null,null,null,null,"2021-12-28",52]
[null,null,null,null,null,null,"2021-12-29",52]
[null,null,null,null,null,null,"2021-12-30",52]
[null,null,null,null,null,null,"2021-12-31",52]
[null,null,null,null,null,null,"2022-01-01",52]
[null,null,null,null,null,null,"2022-01-02",52]
[null,null,null,null,null,null,"2022-01-03",1]
[null,null,null,null,null,null,"2022-01-04",1]
[null,null,null,null,null,null,"2022-01-05",1]
[null,null,null,null,null,null,"2022-01-06",1]
[null,null,null,null,null,null,"2022-01-07",1]
[null,null,null,null,null,null,"2022-01-08",1]
[null,null,null,null,null,null,"2022-01-09",1]
[null,null,null,null,null,null,"2022-01-10",2]
[null,null,null,null,null,null,"2022-01-11",2]
[null,null,null,null,null,null,"2022-01-12",2]
[null,null,null,null,null,null,"2022-01-13",2]
[null,null,null,null,null,null,"2022-01-14",2]
[null,null,null,null,null,null,"2022-01-15",2]
[null,null,null,null,null,null,"2022-01-16",2]
[null,null,null,null,null,null,"2022-01-17",3]
[null,null,null,null,null,null,"2022-01-18",3]
[null,null,null,null,null,null,"2022-01-19",3]
[null,null,null,null,null,null,"2022-01-20",3]
[null,null,null,null,null,null,"2022-01-21",3]
[null,null,null,null,null,null,"2022-01-22",3]
[null,null,null,null,null,null,"2022-01-23",3]
[null,null,null,null,null,null,"2022-01-24",4]
[null,null,null,null,null,null,"2022-01-25",4]
[null,null,null,null,null,null,"2022-01-26",4]
[null,null,null,null,null,null,"2022-01-27",4]
[null,null,null,null,null,null,"2022-01-28",4]
[null,null,null,null,null,null,"2022-01-29",4]
[null,null,null,null,null,null,"2022-01-30",4]
[null,null,null,null,null,null,"2022-01-31",5]
[null,null,null,null,null,null,"2022-02-01",5]
[null,null,null,null,null,null,"2022-02-02",5]
[null,null,null,null,null,null,"2022-02-03",5]
[null,null,null,null,null,null,"2022-02-04",5]
[null,null,null,null,null,null,"2022-02-05",5]
[null,null,null,null,null,null,"2022-02-06",5]
[null,null,null,null,null,null,"2022-02-07",6]
[null,null,null,null,null,null,"2022-02-08",6]
[null,null,null,null,null,null,"2022-02-09",6]
[null,null,null,null,null,null,"2022-02-10",6]
[null,null,null,null,null,null,"2022-02-11",6]
[null,null,null,null,null,null,"2022-02-12",6]
[null,null,null,null,null,null,"2022-02-13",6]
[null,null,null,null,null,null,"2022-02-14",7]
[null,null,null,null,null,null,"2022-02-15",7]
[null,null,null,null,null,null,"2022-02-16",7]
[null,null,null,null,null,null,"2022-02-17",7]
[null,null,null,null,null,null,"2022-02-18",7]
[null,null,null,null,null,null,"2022-02-19",7]
[null,null,null,null,null,null,"2022-02-20",7]
[null,null,null,null,null,null,"2022-02-21",8]
[null,null,null,null,null,null,"2022-02-22",8]
[null,null,null,null,null,null,"2022-02-23",8]
[null,null,null,null,null,null,"2022-02-24",8]
[null,null,null,null,null,null,"2022-02-25",8]
[null,null,null,null,null,null,"2022-02-26",8]
[null,null,null,null,null,null,"2022-02-27",8]
[null,null,null,null,null,null,"2022-02-28",9]
[null,null,null,null,null,null,"2022-03-01",9]
[null,null,null,null,null,null,"2022-03-02",9]
[null,null,null,null,null,null,"2022-03-03",9]
[null,null,null,null,null,null,"2022-03-04",9]
[null,null,null,null,null,null,"2022-03-05",9]
[null,null,null,null,null,null,"2022-03-06",9]
[null,null,null,null,null,null,"2022-03-07",10]
[null,null,null,null,null,null,"2022-03-08",10]
[null,null,null,null,null,null,"2022-03-09",10]
[null,null,null,null,null,null,"2022-03-10",10]
[null,null,null,null,null,null,"2022-03-11",10]
[null,null,null,null,null,null,"2022-03-12",10]
[null,null,null,null,null,null,"2022-03-13",10]
[null,null,null,null,null,null,"2022-03-14",11]
[null,null,null,null,null,null,"2022-03-15",11]
[null,null,null,null,null,null,"2022-03-16",11]
[null,null,null,null,null,null,"2022-03-17",11]
[null,null,null,null,null,null,"2022-03-18",11]
[null,null,null,null,null,null,"2022-03-19",11]
[null,null,null,null,null,null,"2022-03-20",11]
[null,null,null,null,null,null,"2022-03-21",12]
[null,null,null,null,null,null,"2022-03-22",12]
[null,null,null,null,null,null,"2022-03-23",12]
[null,null,null,null,null,null,"2022-03-24",12]
[null,null,null,null,null,null,"2022-03-25",12]
[null,null,null,null,null,null,"2022-03-26",12]
[null,null,null,null,null,null,"2022-03-27",12]
[null,null,null,null,null,null,"2022-03-28",13]
[null,null,null,null,null,null,"2022-03-29",13]
[null,null,null,null,null,null,"2022-03-30",13]
[null,null,null,null,null,null,"2022-03-31",13]
[null,null,null,null,null,null,"2022-04-01",13]
[null,null,null,null,null,null,"2022-04-02",13]
[null,null,null,null,null,null,"2022-04-03",13]
[null,null,null,null,null,null,"2022-04-04",14]
[null,null,null,null,null,null,"2022-04-05",14]
[null,null,null,null,null,null,"2022-04-06",14]
[null,null,null,null,null,null,"2022-04-07",14]
[null,null,null,null,null,null,"2022-04-08",14]
[null,null,null,null,null,null,"2022-04-09",14]
[null,null,null,null,null,null,"2022-04-10",14]
[null,null,null,null,null,null,"2022-04-11",15]
[null,null,null,null,null,null,"2022-04-12",15]
[null,null,null,null,null,null,"2022-04-13",15]
[null,null,null,null,null,null,"2022-04-14",15]
[null,null,null,null,null,null,"2022-04-15",15]
[null,null,null,null,null,null,"2022-04-16",15]
[null,null,null,null,null,null,"2022-04-17",15]
[null,null,null,null,null,null,"2022-04-18",16]
[null,null,null,null,null,null,"2022-04-19",16]
[null,null,null,null,null,null,"2022-04-20",16]
[null,null,null,null,null,null,"2022-04-21",16]
[null,null,null,null,null,null,"2022-04-22",16]
[null,null,null,null,null,null,"2022-04-23",16]
[null,null,null,null,null,null,"2022-04-24",16]
[null,null,null,null,null,null,"2022-04-25",17]
[null,null,null,null,null,null,"2022-04-26",17]
[null,null,null,null,null,null,"2022-04-27",17]
[null,null,null,null,null,null,"2022-04-28",17]
[null,null,null,null,null,null,"2022-04-29",17]
[null,null,null,null,null,null,"2022-04-30",17]
[null,null,null,null,null,null,"2022-05-01",17]
[null,null,null,null,null,null,"2022-05-02",18]
[null,null,null,null,null,null,"2022-05-03",18]
[null,null,null,null,null,null,"2022-05-04",18]
[null,null,null,null,null,null,"2022-05-05",18]
[null,null,null,null,null,null,"2022-05-06",18]
[null,null,null,null,null,null,"2022-05-07",18]
[null,null,null,null,null,null,"2022-05-08",18]
[null,null,null,null,null,null,"2022-05-09",19]
[null,null,null,null,null,null,"2022-05-10",19]
[null,null,null,null,null,null,"2022-05-11",19]
[null,null,null,null,null,null,"2022-05-12",19]
[null,null,null,null,null,null,"2022-05-13",19]
[null,null,null,null,null,null,"2022-05-14",19]
[null,null,null,null,null,null,"2022-05-15",19]
[null,null,null,null,null,null,"2022-05-16",20]
[null,null,null,null,null,null,"2022-05-17",20]
[null,null,null,null,null,null,"2022-05-18",20]
[null,null,null,null,null,null,"2022-05-19",20]
[null,null,null,null,null,null,"2022-05-20",20]
[null,null,null,null,null,null,"2022-05-21",20]
[null,null,null,null,null,null,"2022-05-22",20]
[null,null,null,null,null,null,"2022-05-23",21]
[null,null,null,null,null,null,"2022-05-24",21]
[null,null,null,null,null,null,"2022-05-25",21]
[null,null,null,null,null,null,"2022-05-26",21]
[null,null,null,null,null,null,"2022-05-27",21]
[null,null,null,null,null,null,"2022-05-28",21]
[null,null,null,null,null,null,"2022-05-29",21]
[null,null,null,null,null,null,"2022-05-30",22]
[null,null,null,null,null,null,"2022-05-31",22]
[null,null,null,null,null,null,"2022-06-01",22]
[null,null,null,null,null,null,"2022-06-02",22]
[null,null,null,null,null,null,"2022-06-03",22]
[null,null,null,null,null,null,"2022-06-04",22]
[null,null,null,null,null,null,"2022-06-05",22]
[null,null,null,null,null,null,"2022-06-06",23]
[null,null,null,null,null,null,"2022-06-07",23]
[null,null,null,null,null,null,"2022-06-08",23]
[null,null,null,null,null,null,"2022-06-09",23]
[null,null,null,null,null,null,"2022-06-10",23]
[null,null,null,null,null,null,"2022-06-11",23]
[null,null,null,null,null,null,"2022-06-12",23]
[null,null,null,null,null,null,"2022-06-13",24]
[null,null,null,null,null,null,"2022-06-14",24]
[null,null,null,null,null,null,"2022-06-15",24]
[null,null,null,null,null,null,"2022-06-16",24]
[null,null,null,null,null,null,"2022-06-17",24]
[null,null,null,null,null,null,"2022-06-18",24]
[null,null,null,null,null,null,"2022-06-19",24]
[null,null,null,null,null,null,"2022-06-20",25]
[null,null,null,null,null,null,"2022-06-21",25]
[null,null,null,null,null,null,"2022-06-22",25]
[null,null,null,null,null,null,"2022-06-23",25]
[null,null,null,null,null,null,"2022-06-24",25]
[null,null,null,null,null,null,"2022-06-25",25]
[null,null,null,null,null,null,"2022-06-26",25]
[null,null,null,null,null,null,"2022-06-27",26]
[null,null,null,null,null,null,"2022-06-28",26]
[null,null,null,null,null,null,"2022-06-29",26]
[null,null,null,null,null,null,"2022-06-30",26]
[null,null,null,null,null,null,"2022-07-01",26]
[null,null,null,null,null,null,"2022-07-02",26]
[null,null,null,null,null,null,"2022-07-03",26]
[null,null,null,null,null,null,"2022-07-04",27]
[null,null,null,null,null,null,"2022-07-05",27]
[null,null,null,null,null,null,"2022-07-06",27]
[null,null,null,null,null,null,"2022-07-07",27]
[null,null,null,null,null,null,"2022-07-08",27]
[null,null,null,null,null,null,"2022-07-09",27]
[null,null,null,null,null,null,"2022-07-10",27]
[null,null,null,null,null,null,"2022-07-11",28]
[null,null,null,null,null,null,"2022-07-12",28]
[null,null,null,null,null,null,"2022-07-13",28]
[null,null,null,null,null,null,"2022-07-14",28]
[null,null,null,null,null,null,"2022-07-15",28]
[null,null,null,null,null,null,"2022-07-16",28]
[null,null,null,null,null,null,"2022-07-17",28]
[null,null,null,null,null,null,"2022-07-18",29]
[null,null,null,null,null,null,"2022-07-19",29]
[null,null,null,null,null,null,"2022-07-20",29]
[null,null,null,null,null,null,"2022-07-21",29]
[null,null,null,null,null,null,"2022-07-22",29]
[null,null,null,null,null,null,"2022-07-23",29]
[null,null,null,null,null,null,"2022-07-24",29]
[null,null,null,null,null,null,"2022-07-25",30]
[null,null,null,null,null,null,"2022-07-26",30]
[null,null,null,null,null,null,"2022-07-27",30]
[null,null,null,null,null,null,"2022-07-28",30]
[null,null,null,null,null,null,"2022-07-29",30]
[null,null,null,null,null,null,"2022-07-30",30]
[null,null,null,null,null,null,"2022-07-31",30]
[null,null,null,null,null,null,"2022-08-01",31]
[null,null,null,null,null,null,"2022-08-02",31]
[null,null,null,null,null,null,"2022-08-03",31]
[null,null,null,null,null,null,"2022-08-04",31]
[null,null,null,null,null,null,"2022-08-05",31]
[null,null,null,null,null,null,"2022-08-06",31]
[null,null,null,null,null,null,"2022-08-07",31]
[null,null,null,null,null,null,"2022-08-08",32]
[null,null,null,null,null,null,"2022-08-09",32]
[null,null,null,null,null,null,"2022-08-10",32]
[null,null,null,null,null,null,"2022-08-11",32]
[null,null,null,null,null,null,"2022-08-12",32]
[null,null,null,null,null,null,"2022-08-13",32]
[null,null,null,null,null,null,"2022-08-14",32]
[null,null,null,null,null,null,"2022-08-15",33]
[null,null,null,null,null,null,"2022-08-16",33]
[null,null,null,null,null,null,"2022-08-17",33]
[null,null,null,null,null,null,"2022-08-18",33]
[null,null,null,null,null,null,"2022-08-19",33]
[null,null,null,null,null,null,"2022-08-20",33]
[null,null,null,null,null,null,"2022-08-21",33]
[null,null,null,null,null,null,"2022-08-22",34]
[null,null,null,null,null,null,"2022-08-23",34]
[null,null,null,null,null,null,"2022-08-24",34]
[null,null,null,null,null,null,"2022-08-25",34]
[null,null,null,null,null,null,"2022-08-26",34]
[null,null,null,null,null,null,"2022-08-27",34]
[null,null,null,null,null,null,"2022-08-28",34]
[null,null,null,null,null,null,"2022-08-29",35]
[null,null,null,null,null,null,"2022-08-30",35]
[null,null,null,null,null,null,"2022-08-31",35]
[null,null,null,null,null,null,"2022-09-01",35]
[null,null,null,null,null,null,"2022-09-02",35]
[null,null,null,null,null,null,"2022-09-03",35]
[null,null,null,null,null,null,"2022-09-04",35]
[null,null,null,null,null,null,"2022-09-05",36]
[null,null,null,null,null,null,"2022-09-06",36]
[null,null,null,null,null,null,"2022-09-07",36]
[null,null,null,null,null,null,"2022-09-08",36]
[null,null,null,null,null,null,"2022-09-09",36]
[null,null,null,null,null,null,"2022-09-10",36]
[null,null,null,null,null,null,"2022-09-11",36]
[null,null,null,null,null,null,"2022-09-12",37]
[null,null,null,null,null,null,"2022-09-13",37]
[null,null,null,null,null,null,"2022-09-14",37]
[null,null,null,null,null,null,"2022-09-15",37]
[null,null,null,null,null,null,"2022-09-16",37]
[null,null,null,null,null,null,"2022-09-17",37]
[null,null,null,null,null,null,"2022-09-18",37]
[null,null,null,null,null,null,"2022-09-19",38]
[null,null,null,null,null,null,"2022-09-20",38]
[null,null,null,null,null,null,"2022-09-21",38]
[null,null,null,null,null,null,"2022-09-22",38]
[null,null,null,null,null,null,"2022-09-23",38]
[null,null,null,null,null,null,"2022-09-24",38]
[null,null,null,null,null,null,"2022-09-25",38]
[null,null,null,null,null,null,"2022-09-26",39]
[null,null,null,null,null,null,"2022-09-27",39]
[null,null,null,null,null,null,"2022-09-28",39]
[null,null,null,null,null,null,"2022-09-29",39]
[null,null,null,null,null,null,"2022-09-30",39]
[null,null,null,null,null,null,"2022-10-01",39]
[null,null,null,null,null,null,"2022-10-02",39]
[null,null,null,null,null,null,"2022-10-03",40]
[null,null,null,null,null,null,"2022-10-04",40]
[null,null,null,null,null,null,"2022-10-05",40]
[null,null,null,null,null,null,"2022-10-06",40]
[null,null,null,null,null,null,"2022-10-07",40]
[null,null,null,null,null,null,"2022-10-08",40]
[null,null,null,null,null,null,"2022-10-09",40]
[null,null,null,null,null,null,"2022-10-10",41]
[null,null,null,null,null,null,"2022-10-11",41]
[null,null,null,null,null,null,"2022-10-12",41]
[null,null,null,null,null,null,"2022-10-13",41]
[null,null,null,null,null,null,"2022-10-14",41]
[null,null,null,null,null,null,"2022-10-15",41]
[null,null,null,null,null,null,"2022-10-16",41]
[null,null,null,null,null,null,"2022-10-17",42]
[null,null,null,null,null,null,"2022-10-18",42]
[null,null,null,null,null,null,"2022-10-19",42]
[null,null,null,null,null,null,"2022-10-20",42]
[null,null,null,null,null,null,"2022-10-21",42]
[null,null,null,null,null,null,"2022-10-22",42]
[null,null,null,null,null,null,"2022-10-23",42]
[null,null,null,null,null,null,"2022-10-24",43]
[null,null,null,null,null,null,"2022-10-25",43]
[null,null,null,null,null,null,"2022-10-26",43]
[null,null,null,null,null,null,"2022-10-27",43]
[null,null,null,null,null,null,"2022-10-28",43]
[null,null,null,null,null,null,"2022-10-29",43]
[null,null,null,null,null,null,"2022-10-30",43]
[null,null,null,null,null,null,"2022-10-31",44]
[null,null,null,null,null,null,"2022-11-01",44]
[null,null,null,null,null,null,"2022-11-02",44]
[null,null,null,null,null,null,"2022-11-03",44]
[null,null,null,null,null,null,"2022-11-04",44]
[null,null,null,null,null,null,"2022-11-05",44]
[null,null,null,null,null,null,"2022-11-06",44]
[null,null,null,null,null,null,"2022-11-07",45]
[null,null,null,null,null,null,"2022-11-08",45]
[null,null,null,null,null,null,"2022-11-09",45]
[null,null,null,null,null,null,"2022-11-10",45]
[null,null,null,null,null,null,"2022-11-11",45]
[null,null,null,null,null,null,"2022-11-12",45]
[null,null,null,null,null,null,"2022-11-13",45]
[null,null,null,null,null,null,"2022-11-14",46]
[null,null,null,null,null,null,"2022-11-15",46]
[null,null,null,null,null,null,"2022-11-16",46]
[null,null,null,null,null,null,"2022-11-17",46]
[null,null,null,null,null,null,"2022-11-18",46]
[null,null,null,null,null,null,"2022-11-19",46]
[null,null,null,null,null,null,"2022-11-20",46]
[null,null,null,null,null,null,"2022-11-21",47]
[null,null,null,null,null,null,"2022-11-22",47]
[null,null,null,null,null,null,"2022-11-23",47]
[null,null,null,null,null,null,"2022-11-24",47]
[null,null,null,null,null,null,"2022-11-25",47]
[null,null,null,null,null,null,"2022-11-26",47]
[null,null,null,null,null,null,"2022-11-27",47]
[null,null,null,null,null,null,"2022-11-28",48]
[null,null,null,null,null,null,"2022-11-29",48]
[null,null,null,null,null,null,"2022-11-30",48]
[null,null,null,null,null,null,"2022-12-01",48]
[null,null,null,null,null,null,"2022-12-02",48]
[null,null,null,null,null,null,"2022-12-03",48]
[null,null,null,null,null,null,"2022-12-04",48]
[null,null,null,null,null,null,"2022-12-05",49]
[null,null,null,null,null,null,"2022-12-06",49]
[null,null,null,null,null,null,"2022-12-07",49]
[null,null,null,null,null,null,"2022-12-08",49]
[null,null,null,null,null,null,"2022-12-09",49]
[null,null,null,null,null,null,"2022-12-10",49]
[null,null,null,null,null,null,"2022-12-11",49]
[null,null,null,null,null,null,"2022-12-12",50]
[null,null,null,null,null,null,"2022-12-13",50]
[null,null,null,null,null,null,"2022-12-14",50]
[null,null,null,null,null,null,"2022-12-15",50]
[null,null,null,null,null,null,"2022-12-16",50]
[null,null,null,null,null,null,"2022-12-17",50]
[null,null,null,null,null,null,"2022-12-18",50]
[null,null,null,null,null,null,"2022-12-19",51]
[null,null,null,null,null,null,"2022-12-20",51]
[null,null,null,null,null,null,"2022-12-21",51]
[null,null,null,null,null,null,"2022-12-22",51]
[null,null,null,null,null,null,"2022-12-23",51]
[null,null,null,null,null,null,"2022-12-24",51]
[null,null,null,null,null,null,"2022-12-25",51]
[null,null,null,null,null,null,"2022-12-26",52]
[null,null,null,null,null,null,"2022-12-27",52]
[null,null,null,null,null,null,"2022-12-28",52]
[null,null,null,null,null,null,"2022-12-29",52]
[null,null,null,null,null,null,"2022-12-30",52]
[null,null,null,null,null,null,"2022-12-31",52]
[null,null,null,null,null,null,"2023-01-01",52]
[null,null,null,null,null,null,"2023-01-02",1]
[null,null,null,null,null,null,"2023-01-03",1]
[null,null,null,null,null,null,"2023-01-04",1]
[null,null,null,null,null,null,"2023-01-05",1]
[null,null,null,null,null,null,"2023-01-06",1]
[null,null,null,null,null,null,"2023-01-07",1]
[null,null,null,null,null,null,"2023-01-08",1]
[null,null,null,null,null,null,"2023-01-09",2]
[null,null,null,null,null,null,"2023-01-10",2]
[null,null,null,null,null,null,"2023-01-11",2]
[null,null,null,null,null,null,"2023-01-12",2]
[null,null,null,null,null,null,"2023-01-13",2]
[null,null,null,null,null,null,"2023-01-14",2]
[null,null,null,null,null,null,"2023-01-15",2]
[null,null,null,null,null,null,"2023-01-16",3]
[null,null,null,null,null,null,"2023-01-17",3]
[null,null,null,null,null,null,"2023-01-18",3]
[null,null,null,null,null,null,"2023-01-19",3]
[null,null,null,null,null,null,"2023-01-20",3]
[null,null,null,null,null,null,"2023-01-21",3]
[null,null,null,null,null,null,"2023-01-22",3]
[null,null,null,null,null,null,"2023-01-23",4]
[null,null,null,null,null,null,"2023-01-24",4]
[null,null,null,null,null,null,"2023-01-25",4]
[null,null,null,null,null,null,"2023-01-26",4]
[null,null,null,null,null,null,"2023-01-27",4]
[null,null,null,null,null,null,"2023-01-28",4]
[null,null,null,null,null,null,"2023-01-29",4]
[null,null,null,null,null,null,"2023-01-30",5]
[null,null,null,null,null,null,"2023-01-31",5]
[null,null,null,null,null,null,"2023-02-01",5]
[null,null,null,null,null,null,"2023-02-02",5]
[null,null,null,null,null,null,"2023-02-03",5]
[null,null,null,null,null,null,"2023-02-04",5]
[null,null,null,null,null,null,"2023-02-05",5]
[null,null,null,null,null,null,"2023-02-06",6]
[null,null,null,null,null,null,"2023-02-07",6]
[null,null,null,null,null,null,"2023-02-08",6]
[null,null,null,null,null,null,"2023-02-09",6]
[null,null,null,null,null,null,"2023-02-10",6]
[null,null,null,null,null,null,"2023-02-11",6]
[null,null,null,null,null,null,"2023-02-12",6]
[null,null,null,null,null,null,"2023-02-13",7]
[null,null,null,null,null,null,"2023-02-14",7]
[null,null,null,null,null,null,"2023-02-15",7]
[null,null,null,null,null,null,"2023-02-16",7]
[null,null,null,null,null,null,"2023-02-17",7]
[null,null,null,null,null,null,"2023-02-18",7]
[null,null,null,null,null,null,"2023-02-19",7]
[null,null,null,null,null,null,"2023-02-20",8]
[null,null,null,null,null,null,"2023-02-21",8]
[null,null,null,null,null,null,"2023-02-22",8]
[null,null,null,null,null,null,"2023-02-23",8]
[null,null,null,null,null,null,"2023-02-24",8]
[null,null,null,null,null,null,"2023-02-25",8]
[null,null,null,null,null,null,"2023-02-26",8]
[null,null,null,null,null,null,"2023-02-27",9]
[null,null,null,null,null,null,"2023-02-28",9]
[null,null,null,null,null,null,"2023-03-01",9]
[null,null,null,null,null,null,"2023-03-02",9]
[null,null,null,null,null,null,"2023-03-03",9]
[null,null,null,null,null,null,"2023-03-04",9]
[null,null,null,null,null,null,"2023-03-05",9]
[null,null,null,null,null,null,"2023-03-06",10]
[null,null,null,null,null,null,"2023-03-07",10]
[null,null,null,null,null,null,"2023-03-08",10]
[null,null,null,null,null,null,"2023-03-09",10]
[null,null,null,null,null,null,"2023-03-10",10]
[null,null,null,null,null,null,"2023-03-11",10]
[null,null,null,null,null,null,"2023-03-12",10]
[null,null,null,null,null,null,"2023-03-13",11]
[null,null,null,null,null,null,"2023-03-14",11]
[null,null,null,null,null,null,"2023-03-15",11]
[null,null,null,null,null,null,"2023-03-16",11]
[null,null,null,null,null,null,"2023-03-17",11]
[null,null,null,null,null,null,"2023-03-18",11]
[null,null,null,null,null,null,"2023-03-19",11]
[null,null,null,null,null,null,"2023-03-20",12]
[null,null,null,null,null,null,"2023-03-21",12]
[null,null,null,null,null,null,"2023-03-22",12]
[null,null,null,null,null,null,"2023-03-23",12]
[null,null,null,null,null,null,"2023-03-24",12]
[null,null,null,null,null,null,"2023-03-25",12]
[null,null,null,null,null,null,"2023-03-26",12]
[null,null,null,null,null,null,"2023-03-27",13]
[null,null,null,null,null,null,"2023-03-28",13]
[null,null,null,null,null,null,"2023-03-29",13]
[null,null,null,null,null,null,"2023-03-30",13]
[null,null,null,null,null,null,"2023-03-31",13]
[null,null,null,null,null,null,"2023-04-01",13]
[null,null,null,null,null,null,"2023-04-02",13]
[null,null,null,null,null,null,"2023-04-03",14]
[null,null,null,null,null,null,"2023-04-04",14]
[null,null,null,null,null,null,"2023-04-05",14]
[null,null,null,null,null,null,"2023-04-06",14]
[null,null,null,null,null,null,"2023-04-07",14]
[null,null,null,null,null,null,"2023-04-08",14]
[null,null,null,null,null,null,"2023-04-09",14]
[null,null,null,null,null,null,"2023-04-10",15]
[null,null,null,null,null,null,"2023-04-11",15]
[null,null,null,null,null,null,"2023-04-12",15]
[null,null,null,null,null,null,"2023-04-13",15]
[null,null,null,null,null,null,"2023-04-14",15]
[null,null,null,null,null,null,"2023-04-15",15]
[null,null,null,null,null,null,"2023-04-16",15]
[null,null,null,null,null,null,"2023-04-17",16]
[null,null,null,null,null,null,"2023-04-18",16]
[null,null,null,null,null,null,"2023-04-19",16]
[null,null,null,null,null,null,"2023-04-20",16]
[null,null,null,null,null,null,"2023-04-21",16]
[null,null,null,null,null,null,"2023-04-22",16]
[null,null,null,null,null,null,"2023-04-23",16]
[null,null,null,null,null,null,"2023-04-24",17]
[null,null,null,null,null,null,"2023-04-25",17]
[null,null,null,null,null,null,"2023-04-26",17]
[null,null,null,null,null,null,"2023-04-27",17]
[null,null,null,null,null,null,"2023-04-28",17]
[null,null,null,null,null,null,"2023-04-29",17]
[null,null,null,null,null,null,"2023-04-30",17]
[null,null,null,null,null,null,"2023-05-01",18]
[null,null,null,null,null,null,"2023-05-02",18]
[null,null,null,null,null,null,"2023-05-03",18]
[null,null,null,null,null,null,"2023-05-04",18]
[null,null,null,null,null,null,"2023-05-05",18]
[null,null,null,null,null,null,"2023-05-06",18]
[null,null,null,null,null,null,"2023-05-07",18]
[null,null,null,null,null,null,"2023-05-08",19]
[null,null,null,null,null,null,"2023-05-09",19]
[null,null,null,null,null,null,"2023-05-10",19]
[null,null,null,null,null,null,"2023-05-11",19]
[null,null,null,null,null,null,"2023-05-12",19]
[null,null,null,null,null,null,"2023-05-13",19]
[null,null,null,null,null,null,"2023-05-14",19]
[null,null,null,null,null,null,"2023-05-15",20]
[null,null,null,null,null,null,"2023-05-16",20]
[null,null,null,null,null,null,"2023-05-17",20]
[null,null,null,null,null,null,"2023-05-18",20]
[null,null,null,null,null,null,"2023-05-19",20]
[null,null,null,null,null,null,"2023-05-20",20]
[null,null,null,null,null,null,"2023-05-21",20]
[null,null,null,null,null,null,"2023-05-22",21]
[null,null,null,null,null,null,"2023-05-23",21]
[null,null,null,null,null,null,"2023-05-24",21]
[null,null,null,null,null,null,"2023-05-25",21]
[null,null,null,null,null,null,"2023-05-26",21]
[null,null,null,null,null,null,"2023-05-27",21]
[null,null,null,null,null,null,"2023-05-28",21]
[null,null,null,null,null,null,"2023-05-29",22]
[null,null,null,null,null,null,"2023-05-30",22]
[null,null,null,null,null,null,"2023-05-31",22]
[null,null,null,null,null,null,"2023-06-01",22]
[null,null,null,null,null,null,"2023-06-02",22]
[null,null,null,null,null,null,"2023-06-03",22]
[null,null,null,null,null,null,"2023-06-04",22]
[null,null,null,null,null,null,"2023-06-05",23]
[null,null,null,null,null,null,"2023-06-06",23]
[null,null,null,null,null,null,"2023-06-07",23]
[null,null,null,null,null,null,"2023-06-08",23]
[null,null,null,null,null,null,"2023-06-09",23]
[null,null,null,null,null,null,"2023-06-10",23]
[null,null,null,null,null,null,"2023-06-11",23]
[null,null,null,null,null,null,"2023-06-12",24]
[null,null,null,null,null,null,"2023-06-13",24]
[null,null,null,null,null,null,"2023-06-14",24]
[null,null,null,null,null,null,"2023-06-15",24]
[null,null,null,null,null,null,"2023-06-16",24]
[null,null,null,null,null,null,"2023-06-17",24]
[null,null,null,null,null,null,"2023-06-18",24]
[null,null,null,null,null,null,"2023-06-19",25]
[null,null,null,null,null,null,"2023-06-20",25]
[null,null,null,null,null,null,"2023-06-21",25]
[null,null,null,null,null,null,"2023-06-22",25]
[null,null,null,null,null,null,"2023-06-23",25]
[null,null,null,null,null,null,"2023-06-24",25]
[null,null,null,null,null,null,"2023-06-25",25]
[null,null,null,null,null,null,"2023-06-26",26]
[null,null,null,null,null,null,"2023-06-27",26]
[null,null,null,null,null,null,"2023-06-28",26]
[null,null,null,null,null,null,"2023-06-29",26]
[null,null,null,null,null,null,"2023-06-30",26]
[null,null,null,null,null,null,"2023-07-01",26]
[null,null,null,null,null,null,"2023-07-02",26]
[null,null,null,null,null,null,"2023-07-03",27]
[null,null,null,null,null,null,"2023-07-04",27]
[null,null,null,null,null,null,"2023-07-05",27]
[null,null,null,null,null,null,"2023-07-06",27]
[null,null,null,null,null,null,"2023-07-07",27]
[null,null,null,null,null,null,"2023-07-08",27]
[null,null,null,null,null,null,"2023-07-09",27]
[null,null,null,null,null,null,"2023-07-10",28]
[null,null,null,null,null,null,"2023-07-11",28]
[null,null,null,null,null,null,"2023-07-12",28]
[null,null,null,null,null,null,"2023-07-13",28]
[null,null,null,null,null,null,"2023-07-14",28]
[null,null,null,null,null,null,"2023-07-15",28]
[null,null,null,null,null,null,"2023-07-16",28]
[null,null,null,null,null,null,"2023-07-17",29]
[null,null,null,null,null,null,"2023-07-18",29]
[null,null,null,null,null,null,"2023-07-19",29]
[null,null,null,null,null,null,"2023-07-20",29]
[null,null,null,null,null,null,"2023-07-21",29]
[null,null,null,null,null,null,"2023-07-22",29]
[null,null,null,null,null,null,"2023-07-23",29]
[null,null,null,null,null,null,"2023-07-24",30]
[null,null,null,null,null,null,"2023-07-25",30]
[null,null,null,null,null,null,"2023-07-26",30]
[null,null,null,null,null,null,"2023-07-27",30]
[null,null,null,null,null,null,"2023-07-28",30]
[null,null,null,null,null,null,"2023-07-29",30]
[null,null,null,null,null,null,"2023-07-30",30]
[null,null,null,null,null,null,"2023-07-31",31]
[null,null,null,null,null,null,"2023-08-01",31]
[null,null,null,null,null,null,"2023-08-02",31]
[null,null,null,null,null,null,"2023-08-03",31]
[null,null,null,null,null,null,"2023-08-04",31]
[null,null,null,null,null,null,"2023-08-05",31]
[null,null,null,null,null,null,"2023-08-06",31]
[null,null,null,null,null,null,"2023-08-07",32]
[null,null,null,null,null,null,"2023-08-08",32]
[null,null,null,null,null,null,"2023-08-09",32]
[null,null,null,null,null,null,"2023-08-10",32]
[null,null,null,null,null,null,"2023-08-11",32]
[null,null,null,null,null,null,"2023-08-12",32]
[null,null,null,null,null,null,"2023-08-13",32]
[null,null,null,null,null,null,"2023-08-14",33]
[null,null,null,null,null,null,"2023-08-15",33]
[null,null,null,null,null,null,"2023-08-16",33]
[null,null,null,null,null,null,"2023-08-17",33]
[null,null,null,null,null,null,"2023-08-18",33]
[null,null,null,null,null,null,"2023-08-19",33]
[null,null,null,null,null,null,"2023-08-20",33]
[null,null,null,null,null,null,"2023-08-21",34]
[null,null,null,null,null,null,"2023-08-22",34]
[null,null,null,null,null,null,"2023-08-23",34]
[null,null,null,null,null,null,"2023-08-24",34]
[null,null,null,null,null,null,"2023-08-25",34]
[null,null,null,null,null,null,"2023-08-26",34]
[null,null,null,null,null,null,"2023-08-27",34]
[null,null,null,null,null,null,"2023-08-28",35]
[null,null,null,null,null,null,"2023-08-29",35]
[null,null,null,null,null,null,"2023-08-30",35]
[null,null,null,null,null,null,"2023-08-31",35]
[null,null,null,null,null,null,"2023-09-01",35]
[null,null,null,null,null,null,"2023-09-02",35]
[null,null,null,null,null,null,"2023-09-03",35]
[null,null,null,null,null,null,"2023-09-04",36]
[null,null,null,null,null,null,"2023-09-05",36]
[null,null,null,null,null,null,"2023-09-06",36]
[null,null,null,null,null,null,"2023-09-07",36]
[null,null,null,null,null,null,"2023-09-08",36]
[null,null,null,null,null,null,"2023-09-09",36]
[null,null,null,null,null,null,"2023-09-10",36]
[null,null,null,null,null,null,"2023-09-11",37]
[null,null,null,null,null,null,"2023-09-12",37]
[null,null,null,null,null,null,"2023-09-13",37]
[null,null,null,null,null,null,"2023-09-14",37]
[null,null,null,null,null,null,"2023-09-15",37]
[null,null,null,null,null,null,"2023-09-16",37]
[null,null,null,null,null,null,"2023-09-17",37]
[null,null,null,null,null,null,"2023-09-18",38]
[null,null,null,null,null,null,"2023-09-19",38]
[null,null,null,null,null,null,"2023-09-20",38]
[null,null,null,null,null,null,"2023-09-21",38]
[null,null,null,null,null,null,"2023-09-22",38]
[null,null,null,null,null,null,"2023-09-23",38]
[null,null,null,null,null,null,"2023-09-24",38]
[null,null,null,null,null,null,"2023-09-25",39]
[null,null,null,null,null,null,"2023-09-26",39]
[null,null,null,null,null,null,"2023-09-27",39]
[null,null,null,null,null,null,"2023-09-28",39]
[null,null,null,null,null,null,"2023-09-29",39]
[null,null,null,null,null,null,"2023-09-30",39]
[null,null,null,null,null,null,"2023-10-01",39]
[null,null,null,null,null,null,"2023-10-02",40]
[null,null,null,null,null,null,"2023-10-03",40]
[null,null,null,null,null,null,"2023-10-04",40]
[null,null,null,null,null,null,"2023-10-05",40]
[null,null,null,null,null,null,"2023-10-06",40]
[null,null,null,null,null,null,"2023-10-07",40]
[null,null,null,null,null,null,"2023-10-08",40]
[null,null,null,null,null,null,"2023-10-09",41]
[null,null,null,null,null,null,"2023-10-10",41]
[null,null,null,null,null,null,"2023-10-11",41]
[null,null,null,null,null,null,"2023-10-12",41]
[null,null,null,null,null,null,"2023-10-13",41]
[null,null,null,null,null,null,"2023-10-14",41]
[null,null,null,null,null,null,"2023-10-15",41]
[null,null,null,null,null,null,"2023-10-16",42]
[null,null,null,null,null,null,"2023-10-17",42]
[null,null,null,null,null,null,"2023-10-18",42]
[null,null,null,null,null,null,"2023-10-19",42]
[null,null,null,null,null,null,"2023-10-20",42]
[null,null,null,null,null,null,"2023-10-21",42]
[null,null,null,null,null,null,"2023-10-22",42]
[null,null,null,null,null,null,"2023-10-23",43]
[null,null,null,null,null,null,"2023-10-24",43]
[null,null,null,null,null,null,"2023-10-25",43]
[null,null,null,null,null,null,"2023-10-26",43]
[null,null,null,null,null,null,"2023-10-27",43]
[null,null,null,null,null,null,"2023-10-28",43]
[null,null,null,null,null,null,"2023-10-29",43]
[null,null,null,null,null,null,"2023-10-30",44]
[null,null,null,null,null,null,"2023-10-31",44]
[null,null,null,null,null,null,"2023-11-01",44]
[null,null,null,null,null,null,"2023-11-02",44]
[null,null,null,null,null,null,"2023-11-03",44]
[null,null,null,null,null,null,"2023-11-04",44]
[null,null,null,null,null,null,"2023-11-05",44]
[null,null,null,null,null,null,"2023-11-06",45]
[null,null,null,null,null,null,"2023-11-07",45]
[null,null,null,null,null,null,"2023-11-08",45]
[null,null,null,null,null,null,"2023-11-09",45]
[null,null,null,null,null,null,"2023-11-10",45]
[null,null,null,null,null,null,"2023-11-11",45]
[null,null,null,null,null,null,"2023-11-12",45]
[null,null,null,null,null,null,"2023-11-13",46]
[null,null,null,null,null,null,"2023-11-14",46]
[null,null,null,null,null,null,"2023-11-15",46]
[null,null,null,null,null,null,"2023-11-16",46]
[null,null,null,null,null,null,"2023-11-17",46]
[null,null,null,null,null,null,"2023-11-18",46]
[null,null,null,null,null,null,"2023-11-19",46]
[null,null,null,null,null,null,"2023-11-20",47]
[null,null,null,null,null,null,"2023-11-21",47]
[null,null,null,null,null,null,"2023-11-22",47]
[null,null,null,null,null,null,"2023-11-23",47]
[null,null,null,null,null,null,"2023-11-24",47]
[null,null,null,null,null,null,"2023-11-25",47]
[null,null,null,null,null,null,"2023-11-26",47]
[null,null,null,null,null,null,"2023-11-27",48]
[null,null,null,null,null,null,"2023-11-28",48]
[null,null,null,null,null,null,"2023-11-29",48]
[null,null,null,null,null,null,"2023-11-30",48]
[null,null,null,null,null,null,"2023-12-01",48]
[null,null,null,null,null,null,"2023-12-02",48]
[null,null,null,null,null,null,"2023-12-03",48]
[null,null,null,null,null,null,"2023-12-04",49]
[null,null,null,null,null,null,"2023-12-05",49]
[null,null,null,null,null,null,"2023-12-06",49]
[null,null,null,null,null,null,"2023-12-07",49]
[null,null,null,null,null,null,"2023-12-08",49]
[null,null,null,null,null,null,"2023-12-09",49]
[null,null,null,null,null,null,"2023-12-10",49]
[null,null,null,null,null,null,"2023-12-11",50]
[null,null,null,null,null,null,"2023-12-12",50]
[null,null,null,null,null,null,"2023-12-13",50]
[null,null,null,null,null,null,"2023-12-14",50]
[null,null,null,null,null,null,"2023-12-15",50]
[null,null,null,null,null,null,"2023-12-16",50]
[null,null,null,null,null,null,"2023-12-17",50]
[null,null,null,null,null,null,"2023-12-18",51]
[null,null,null,null,null,null,"2023-12-19",51]
[null,null,null,null,null,null,"2023-12-20",51]
[null,null,null,null,null,null,"2023-12-21",51]
[null,null,null,null,null,null,"2023-12-22",51]
[null,null,null,null,null,null,"2023-12-23",51]
[null,null,null,null,null,null,"2023-12-24",51]
[null,null,null,null,null,null,"2023-12-25",52]
[null,null,null,null,null,null,"2023-12-26",52]
[null,null,null,null,null,null,"2023-12-27",52]
[null,null,null,null,null,null,"2023-12-28",52]
[null,null,null,null,null,null,"2023-12-29",52]
[null,null,null,null,null,null,"2023-12-30",52]
[null,null,null,null,null,null,"2023-12-31",52]
[null,null,null,null,null,null,"2024-01-01",1]
[null,null,null,null,null,null,"2024-01-02",1]
[null,null,null,null,null,null,"2024-01-03",1]
[null,null,null,null,null,null,"2024-01-04",1]
[null,null,null,null,null,null,"2024-01-05",1]
[null,null,null,null,null,null,"2024-01-06",1]
[null,null,null,null,null,null,"2024-01-07",1]
[null,null,null,null,null,null,"2024-01-08",2]
[null,null,null,null,null,null,"2024-01-09",2]
[null,null,null,null,null,null,"2024-01-10",2]
[null,null,null,null,null,null,"2024-01-11",2]
[null,null,null,null,null,null,"2024-01-12",2]
[null,null,null,null,null,null,"2024-01-13",2]
[null,null,null,null,null,null,"2024-01-14",2]
[null,null,null,null,null,null,"2024-01-15",3]
[null,null,null,null,null,null,"2024-01-16",3]
[null,null,null,null,null,null,"2024-01-17",3]
[null,null,null,null,null,null,"2024-01-18",3]
[null,null,null,null,null,null,"2024-01-19",3]
[null,null,null,null,null,null,"2024-01-20",3]
[null,null,null,null,null,null,"2024-01-21",3]
[null,null,null,null,null,null,"2024-01-22",4]
[null,null,null,null,null,null,"2024-01-23",4]
[null,null,null,null,null,null,"2024-01-24",4]
[null,null,null,null,null,null,"2024-01-25",4]
[null,null,null,null,null,null,"2024-01-26",4]
[null,null,null,null,null,null,"2024-01-27",4]
[null,null,null,null,null,null,"2024-01-28",4]
[null,null,null,null,null,null,"2024-01-29",5]
[null,null,null,null,null,null,"2024-01-30",5]
[null,null,null,null,null,null,"2024-01-31",5]
[null,null,null,null,null,null,"2024-02-01",5]
[null,null,null,null,null,null,"2024-02-02",5]
[null,null,null,null,null,null,"2024-02-03",5]
[null,null,null,null,null,null,"2024-02-04",5]
[null,null,null,null,null,null,"2024-02-05",6]
[null,null,null,null,null,null,"2024-02-06",6]
[null,null,null,null,null,null,"2024-02-07",6]
[null,null,null,null,null,null,"2024-02-08",6]
[null,null,null,null,null,null,"2024-02-09",6]
[null,null,null,null,null,null,"2024-02-10",6]
[null,null,null,null,null,null,"2024-02-11",6]
[null,null,null,null,null,null,"2024-02-12",7]
[null,null,null,null,null,null,"2024-02-13",7]
[null,null,null,null,null,null,"2024-02-14",7]
[null,null,null,null,null,null,"2024-02-15",7]
[null,null,null,null,null,null,"2024-02-16",7]
[null,null,null,null,null,null,"2024-02-17",7]
[null,null,null,null,null,null,"2024-02-18",7]
[null,null,null,null,null,null,"2024-02-19",8]
[null,null,null,null,null,null,"2024-02-20",8]
[null,null,null,null,null,null,"2024-02-21",8]
[null,null,null,null,null,null,"2024-02-22",8]
[null,null,null,null,null,null,"2024-02-23",8]
[null,null,null,null,null,null,"2024-02-24",8]
[null,null,null,null,null,null,"2024-02-25",8]
[null,null,null,null,null,null,"2024-02-26",9]
[null,null,null,null,null,null,"2024-02-27",9]
[null,null,null,null,null,null,"2024-02-28",9]
[null,null,null,null,null,null,"2024-02-29",9]
[null,null,null,null,null,null,"2024-03-01",9]
[null,null,null,null,null,null,"2024-03-02",9]
[null,null,null,null,null,null,"2024-03-03",9]
[null,null,null,null,null,null,"2024-03-04",10]
[null,null,null,null,null,null,"2024-03-05",10]
[null,null,null,null,null,null,"2024-03-06",10]
[null,null,null,null,null,null,"2024-03-07",10]
[null,null,null,null,null,null,"2024-03-08",10]
[null,null,null,null,null,null,"2024-03-09",10]
[null,null,null,null,null,null,"2024-03-10",10]
[null,null,null,null,null,null,"2024-03-11",11]
[null,null,null,null,null,null,"2024-03-12",11]
[null,null,null,null,null,null,"2024-03-13",11]
[null,null,null,null,null,null,"2024-03-14",11]
[null,null,null,null,null,null,"2024-03-15",11]
[null,null,null,null,null,null,"2024-03-16",11]
[null,null,null,null,null,null,"2024-03-17",11]
[null,null,null,null,null,null,"2024-03-18",12]
[null,null,null,null,null,null,"2024-03-19",12]
[null,null,null,null,null,null,"2024-03-20",12]
[null,null,null,null,null,null,"2024-03-21",12]
[null,null,null,null,null,null,"2024-03-22",12]
[null,null,null,null,null,null,"2024-03-23",12]
[null,null,null,null,null,null,"2024-03-24",12]
[null,null,null,null,null,null,"2024-03-25",13]
[null,null,null,null,null,null,"2024-03-26",13]
[null,null,null,null,null,null,"2024-03-27",13]
[null,null,null,null,null,null,"2024-03-28",13]
[null,null,null,null,null,null,"2024-03-29",13]
[null,null,null,null,null,null,"2024-03-30",13]
[null,null,null,null,null,null,"2024-03-31",13]
[null,null,null,null,null,null,"2024-04-01",14]
[null,null,null,null,null,null,"2024-04-02",14]
[null,null,null,null,null,null,"2024-04-03",14]
[null,null,null,null,null,null,"2024-04-04",14]
[null,null,null,null,null,null,"2024-04-05",14]
[null,null,null,null,null,null,"2024-04-06",14]
[null,null,null,null,null,null,"2024-04-07",14]
[null,null,null,null,null,null,"2024-04-08",15]
[null,null,null,null,null,null,"2024-04-09",15]
[null,null,null,null,null,null,"2024-04-10",15]
[null,null,null,null,null,null,"2024-04-11",15]
[null,null,null,null,null,null,"2024-04-12",15]
[null,null,null,null,null,null,"2024-04-13",15]
[null,null,null,null,null,null,"2024-04-14",15]
[null,null,null,null,null,null,"2024-04-15",16]
[null,null,null,null,null,null,"2024-04-16",16]
[null,null,null,null,null,null,"2024-04-17",16]
[null,null,null,null,null,null,"2024-04-18",16]
[null,null,null,null,null,null,"2024-04-19",16]
[null,null,null,null,null,null,"2024-04-20",16]
[null,null,null,null,null,null,"2024-04-21",16]
[null,null,null,null,null,null,"2024-04-22",17]
[null,null,null,null,null,null,"2024-04-23",17]
[null,null,null,null,null,null,"2024-04-24",17]
[null,null,null,null,null,null,"2024-04-25",17]
[null,null,null,null,null,null,"2024-04-26",17]
[null,null,null,null,null,null,"2024-04-27",17]
[null,null,null,null,null,null,"2024-04-28",17]
[null,null,null,null,null,null,"2024-04-29",18]
[null,null,null,null,null,null,"2024-04-30",18]
[null,null,null,null,null,null,"2024-05-01",18]
[null,null,null,null,null,null,"2024-05-02",18]
[null,null,null,null,null,null,"2024-05-03",18]
[null,null,null,null,null,null,"2024-05-04",18]
[null,null,null,null,null,null,"2024-05-05",18]
[null,null,null,null,null,null,"2024-05-06",19]
[null,null,null,null,null,null,"2024-05-07",19]
[null,null,null,null,null,null,"2024-05-08",19]
[null,null,null,null,null,null,"2024-05-09",19]
[null,null,null,null,null,null,"2024-05-10",19]
[null,null,null,null,null,null,"2024-05-11",19]
[null,null,null,null,null,null,"2024-05-12",19]
[null,null,null,null,null,null,"2024-05-13",20]
[null,null,null,null,null,null,"2024-05-14",20]
[null,null,null,null,null,null,"2024-05-15",20]
[null,null,null,null,null,null,"2024-05-16",20]
[null,null,null,null,null,null,"2024-05-17",20]
[null,null,null,null,null,null,"2024-05-18",20]
[null,null,null,null,null,null,"2024-05-19",20]
[null,null,null,null,null,null,"2024-05-20",21]
[null,null,null,null,null,null,"2024-05-21",21]
[null,null,null,null,null,null,"2024-05-22",21]
[null,null,null,null,null,null,"2024-05-23",21]
[null,null,null,null,null,null,"2024-05-24",21]
[null,null,null,null,null,null,"2024-05-25",21]
[null,null,null,null,null,null,"2024-05-26",21]
[null,null,null,null,null,null,"2024-05-27",22]
[null,null,null,null,null,null,"2024-05-28",22]
[null,null,null,null,null,null,"2024-05-29",22]
[null,null,null,null,null,null,"2024-05-30",22]
[null,null,null,null,null,null,"2024-05-31",22]
[null,null,null,null,null,null,"2024-06-01",22]
[null,null,null,null,null,null,"2024-06-02",22]
[null,null,null,null,null,null,"2024-06-03",23]
[null,null,null,null,null,null,"2024-06-04",23]
[null,null,null,null,null,null,"2024-06-05",23]
[null,null,null,null,null,null,"2024-06-06",23]
[null,null,null,null,null,null,"2024-06-07",23]
[null,null,null,null,null,null,"2024-06-08",23]
[null,null,null,null,null,null,"2024-06-09",23]
[null,null,null,null,null,null,"2024-06-10",24]
[null,null,null,null,null,null,"2024-06-11",24]
[null,null,null,null,null,null,"2024-06-12",24]
[null,null,null,null,null,null,"2024-06-13",24]
[null,null,null,null,null,null,"2024-06-14",24]
[null,null,null,null,null,null,"2024-06-15",24]
[null,null,null,null,null,null,"2024-06-16",24]
[null,null,null,null,null,null,"2024-06-17",25]
[null,null,null,null,null,null,"2024-06-18",25]
[null,null,null,null,null,null,"2024-06-19",25]
[null,null,null,null,null,null,"2024-06-20",25]
[null,null,null,null,null,null,"2024-06-21",25]
[null,null,null,null,null,null,"2024-06-22",25]
[null,null,null,null,null,null,"2024-06-23",25]
[null,null,null,null,null,null,"2024-06-24",26]
[null,null,null,null,null,null,"2024-06-25",26]
[null,null,null,null,null,null,"2024-06-26",26]
[null,null,null,null,null,null,"2024-06-27",26]
[null,null,null,null,null,null,"2024-06-28",26]
[null,null,null,null,null,null,"2024-06-29",26]
[null,null,null,null,null,null,"2024-06-30",26]
[null,null,null,null,null,null,"2024-07-01",27]
[null,null,null,null,null,null,"2024-07-02",27]
[null,null,null,null,null,null,"2024-07-03",27]
[null,null,null,null,null,null,"2024-07-04",27]
[null,null,null,null,null,null,"2024-07-05",27]
[null,null,null,null,null,null,"2024-07-06",27]
[null,null,null,null,null,null,"2024-07-07",27]
[null,null,null,null,null,null,"2024-07-08",28]
[null,null,null,null,null,null,"2024-07-09",28]
[null,null,null,null,null,null,"2024-07-10",28]
[null,null,null,null,null,null,"2024-07-11",28]
[null,null,null,null,null,null,"2024-07-12",28]
[null,null,null,null,null,null,"2024-07-13",28]
[null,null,null,null,null,null,"2024-07-14",28]
[null,null,null,null,null,null,"2024-07-15",29]
[null,null,null,null,null,null,"2024-07-16",29]
[null,null,null,null,null,null,"2024-07-17",29]
[null,null,null,null,null,null,"2024-07-18",29]
[null,null,null,null,null,null,"2024-07-19",29]
[null,null,null,null,null,null,"2024-07-20",29]
[null,null,null,null,null,null,"2024-07-21",29]
[null,null,null,null,null,null,"2024-07-22",30]
[null,null,null,null,null,null,"2024-07-23",30]
[null,null,null,null,null,null,"2024-07-24",30]
[null,null,null,null,null,null,"2024-07-25",30]
[null,null,null,null,null,null,"2024-07-26",30]
[null,null,null,null,null,null,"2024-07-27",30]
[null,null,null,null,null,null,"2024-07-28",30]
[null,null,null,null,null,null,"2024-07-29",31]
[null,null,null,null,null,null,"2024-07-30",31]
[null,null,null,null,null,null,"2024-07-31",31]
[null,null,null,null,null,null,"2024-08-01",31]
[null,null,null,null,null,null,"2024-08-02",31]
[null,null,null,null,null,null,"2024-08-03",31]
[null,null,null,null,null,null,"2024-08-04",31]
[null,null,null,null,null,null,"2024-08-05",32]
[null,null,null,null,null,null,"2024-08-06",32]
[null,null,null,null,null,null,"2024-08-07",32]
[null,null,null,null,null,null,"2024-08-08",32]
[null,null,null,null,null,null,"2024-08-09",32]
[null,null,null,null,null,null,"2024-08-10",32]
[null,null,null,null,null,null,"2024-08-11",32]
[null,null,null,null,null,null,"2024-08-12",33]
[null,null,null,null,null,null,"2024-08-13",33]
[null,null,null,null,null,null,"2024-08-14",33]
[null,null,null,null,null,null,"2024-08-15",33]
[null,null,null,null,null,null,"2024-08-16",33]
[null,null,null,null,null,null,"2024-08-17",33]
[null,null,null,null,null,null,"2024-08-18",33]
[null,null,null,null,null,null,"2024-08-19",34]
[null,null,null,null,null,null,"2024-08-20",34]
[null,null,null,null,null,null,"2024-08-21",34]
[null,null,null,null,null,null,"2024-08-22",34]
[null,null,null,null,null,null,"2024-08-23",34]
[null,null,null,null,null,null,"2024-08-24",34]
[null,null,null,null,null,null,"2024-08-25",34]
[null,null,null,null,null,null,"2024-08-26",35]
[null,null,null,null,null,null,"2024-08-27",35]
[null,null,null,null,null,null,"2024-08-28",35]
[null,null,null,null,null,null,"2024-08-29",35]
[null,null,null,null,null,null,"2024-08-30",35]
[null,null,null,null,null,null,"2024-08-31",35]
[null,null,null,null,null,null,"2024-09-01",35]
[null,null,null,null,null,null,"2024-09-02",36]
[null,null,null,null,null,null,"2024-09-03",36]
[null,null,null,null,null,null,"2024-09-04",36]
[null,null,null,null,null,null,"2024-09-05",36]
[null,null,null,null,null,null,"2024-09-06",36]
[null,null,null,null,null,null,"2024-09-07",36]
[null,null,null,null,null,null,"2024-09-08",36]
[null,null,null,null,null,null,"2024-09-09",37]
[null,null,null,null,null,null,"2024-09-10",37]
[null,null,null,null,null,null,"2024-09-11",37]
[null,null,null,null,null,null,"2024-09-12",37]
[null,null,null,null,null,null,"2024-09-13",37]
[null,null,null,null,null,null,"2024-09-14",37]
[null,null,null,null,null,null,"2024-09-15",37]
[null,null,null,null,null,null,"2024-09-16",38]
[null,null,null,null,null,null,"2024-09-17",38]
[null,null,null,null,null,null,"2024-09-18",38]
[null,null,null,null,null,null,"2024-09-19",38]
[null,null,null,null,null,null,"2024-09-20",38]
[null,null,null,null,null,null,"2024-09-21",38]
[null,null,null,null,null,null,"2024-09-22",38]
[null,null,null,null,null,null,"2024-09-23",39]
[null,null,null,null,null,null,"2024-09-24",39]
[null,null,null,null,null,null,"2024-09-25",39]
[null,null,null,null,null,null,"2024-09-26",39]
[null,null,null,null,null,null,"2024-09-27",39]
[null,null,null,null,null,null,"2024-09-28",39]
[null,null,null,null,null,null,"2024-09-29",39]
[null,null,null,null,null,null,"2024-09-30",40]
[null,null,null,null,null,null,"2024-10-01",40]
[null,null,null,null,null,null,"2024-10-02",40]
[null,null,null,null,null,null,"2024-10-03",40]
[null,null,null,null,null,null,"2024-10-04",40]
[null,null,null,null,null,null,"2024-10-05",40]
[null,null,null,null,null,null,"2024-10-06",40]
[null,null,null,null,null,null,"2024-10-07",41]
[null,null,null,null,null,null,"2024-10-08",41]
[null,null,null,null,null,null,"2024-10-09",41]
[null,null,null,null,null,null,"2024-10-10",41]
[null,null,null,null,null,null,"2024-10-11",41]
[null,null,null,null,null,null,"2024-10-12",41]
[null,null,null,null,null,null,"2024-10-13",41]
[null,null,null,null,null,null,"2024-10-14",42]
[null,null,null,null,null,null,"2024-10-15",42]
[null,null,null,null,null,null,"2024-10-16",42]
[null,null,null,null,null,null,"2024-10-17",42]
[null,null,null,null,null,null,"2024-10-18",42]
[null,null,null,null,null,null,"2024-10-19",42]
[null,null,null,null,null,null,"2024-10-20",42]
[null,null,null,null,null,null,"2024-10-21",43]
[null,null,null,null,null,null,"2024-10-22",43]
[null,null,null,null,null,null,"2024-10-23",43]
[null,null,null,null,null,null,"2024-10-24",43]
[null,null,null,null,null,null,"2024-10-25",43]
[null,null,null,null,null,null,"2024-10-26",43]
[null,null,null,null,null,null,"2024-10-27",43]
[null,null,null,null,null,null,"2024-10-28",44]
[null,null,null,null,null,null,"2024-10-29",44]
[null,null,null,null,null,null,"2024-10-30",44]
[null,null,null,null,null,null,"2024-10-31",44]
[null,null,null,null,null,null,"2024-11-01",44]
[null,null,null,null,null,null,"2024-11-02",44]
[null,null,null,null,null,null,"2024-11-03",44]
[null,null,null,null,null,null,"2024-11-04",45]
[null,null,null,null,null,null,"2024-11-05",45]
[null,null,null,null,null,null,"2024-11-06",45]
[null,null,null,null,null,null,"2024-11-07",45]
[null,null,null,null,null,null,"2024-11-08",45]
[null,null,null,null,null,null,"2024-11-09",45]
[null,null,null,null,null,null,"2024-11-10",45]
[null,null,null,null,null,null,"2024-11-11",46]
[null,null,null,null,null,null,"2024-11-12",46]
[null,null,null,null,null,null,"2024-11-13",46]
[null,null,null,null,null,null,"2024-11-14",46]
[null,null,null,null,null,null,"2024-11-15",46]
[null,null,null,null,null,null,"2024-11-16",46]
[null,null,null,null,null,null,"2024-11-17",46]
[null,null,null,null,null,null,"2024-11-18",47]
[null,null,null,null,null,null,"2024-11-19",47]
[null,null,null,null,null,null,"2024-11-20",47]
[null,null,null,null,null,null,"2024-11-21",47]
[null,null,null,null,null,null,"2024-11-22",47]
[null,null,null,null,null,null,"2024-11-23",47]
[null,null,null,null,null,null,"2024-11-24",47]
[null,null,null,null,null,null,"2024-11-25",48]
[null,null,null,null,null,null,"2024-11-26",48]
[null,null,null,null,null,null,"2024-11-27",48]
[null,null,null,null,null,null,"2024-11-28",48]
[null,null,null,null,null,null,"2024-11-29",48]
[null,null,null,null,null,null,"2024-11-30",48]
[null,null,null,null,null,null,"2024-12-01",48]
[null,null,null,null,null,null,"2024-12-02",49]
[null,null,null,null,null,null,"2024-12-03",49]
[null,null,null,null,null,null,"2024-12-04",49]
[null,null,null,null,null,null,"2024-12-05",49]
[null,null,null,null,null,null,"2024-12-06",49]
[null,null,null,null,null,null,"2024-12-07",49]
[null,null,null,null,null,null,"2024-12-08",49]
[null,null,null,null,null,null,"2024-12-09",50]
[null,null,null,null,null,null,"2024-12-10",50]
[null,null,null,null,null,null,"2024-12-11",50]
[null,null,null,null,null,null,"2024-12-12",50]
[null,null,null,null,null,null,"2024-12-13",50]
[null,null,null,null,null,null,"2024-12-14",50]
[null,null,null,null,null,null,"2024-12-15",50]
[null,null,null,null,null,null,"2024-12-16",51]
[null,null,null,null,null,null,"2024-12-17",51]
[null,null,null,null,null,null,"2024-12-18",51]
[null,null,null,null,null,null,"2024-12-19",51]
[null,null,null,null,null,null,"2024-12-20",51]
[null,null,null,null,null,null,"2024-12-21",51]
[null,null,null,null,null,null,"2024-12-22",51]
[null,null,null,null,null,null,"2024-12-23",52]
[null,null,null,null,null,null,"2024-12-24",52]
[null,null,null,null,null,null,"2024-12-25",52]
[null,null,null,null,null,null,"2024-12-26",52]
[null,null,null,null,null,null,"2024-12-27",52]
[null,null,null,null,null,null,"2024-12-28",52]
[null,null,null,null,null,null,"2024-12-29",52]
[null,null,null,null,null,null,"2024-12-30",1]
[null,null,null,null,null,null,"2024-12-31",1]
[null,null,null,null,null,null,"2025-01-01",1]
[null,null,null,null,null,null,"2025-01-02",1]
[null,null,null,null,null,null,"2025-01-03",1]
[null,null,null,null,null,null,"2025-01-04",1]
[null,null,null,null,null,null,"2025-01-05",1]
[null,null,null,null,null,null,"2025-01-06",2]
[null,null,null,null,null,null,"2025-01-07",2]
[null,null,null,null,null,null,"2025-01-08",2]
[null,null,null,null,null,null,"2025-01-09",2]
[null,null,null,null,null,null,"2025-01-10",2]
[null,null,null,null,null,null,"2025-01-11",2]
[null,null,null,null,null,null,"2025-01-12",2]
[null,null,null,null,null,null,"2025-01-13",3]
[null,null,null,null,null,null,"2025-01-14",3]
[null,null,null,null,null,null,"2025-01-15",3]
[null,null,null,null,null,null,"2025-01-16",3]
[null,null,null,null,null,null,"2025-01-17",3]
[null,null,null,null,null,null,"2025-01-18",3]
[null,null,null,null,null,null,"2025-01-19",3]
[null,null,null,null,null,null,"2025-01-20",4]
[null,null,null,null,null,null,"2025-01-21",4]
[null,null,null,null,null,null,"2025-01-22",4]
[null,null,null,null,null,null,"2025-01-23",4]
[null,null,null,null,null,null,"2025-01-24",4]
[null,null,null,null,null,null,"2025-01-25",4]
[null,null,null,null,null,null,"2025-01-26",4]
[null,null,null,null,null,null,"2025-01-27",5]
[null,null,null,null,null,null,"2025-01-28",5]
[null,null,null,null,null,null,"2025-01-29",5]
[null,null,null,null,null,null,"2025-01-30",5]
[null,null,null,null,null,null,"2025-01-31",5]
[null,null,null,null,null,null,"2025-02-01",5]
[null,null,null,null,null,null,"2025-02-02",5]
[null,null,null,null,null,null,"2025-02-03",6]
[null,null,null,null,null,null,"2025-02-04",6]
[null,null,null,null,null,null,"2025-02-05",6]
[null,null,null,null,null,null,"2025-02-06",6]
[null,null,null,null,null,null,"2025-02-07",6]
[null,null,null,null,null,null,"2025-02-08",6]
[null,null,null,null,null,null,"2025-02-09",6]
[null,null,null,null,null,null,"2025-02-10",7]
[null,null,null,null,null,null,"2025-02-11",7]
[null,null,null,null,null,null,"2025-02-12",7]
[null,null,null,null,null,null,"2025-02-13",7]
[null,null,null,null,null,null,"2025-02-14",7]
[null,null,null,null,null,null,"2025-02-15",7]
[null,null,null,null,null,null,"2025-02-16",7]
[null,null,null,null,null,null,"2025-02-17",8]
[null,null,null,null,null,null,"2025-02-18",8]
[null,null,null,null,null,null,"2025-02-19",8]
[null,null,null,null,null,null,"2025-02-20",8]
[null,null,null,null,null,null,"2025-02-21",8]
[null,null,null,null,null,null,"2025-02-22",8]
[null,null,null,null,null,null,"2025-02-23",8]
[null,null,null,null,null,null,"2025-02-24",9]
[null,null,null,null,null,null,"2025-02-25",9]
[null,null,null,null,null,null,"2025-02-26",9]
[null,null,null,null,null,null,"2025-02-27",9]
[null,null,null,null,null,null,"2025-02-28",9]
[null,null,null,null,null,null,"2025-03-01",9]
[null,null,null,null,null,null,"2025-03-02",9]
[null,null,null,null,null,null,"2025-03-03",10]
[null,null,null,null,null,null,"2025-03-04",10]
[null,null,null,null,null,null,"2025-03-05",10]
[null,null,null,null,null,null,"2025-03-06",10]
[null,null,null,null,null,null,"2025-03-07",10]
[null,null,null,null,null,null,"2025-03-08",10]
[null,null,null,null,null,null,"2025-03-09",10]
[null,null,null,null,null,null,"2025-03-10",11]
[null,null,null,null,null,null,"2025-03-11",11]
[null,null,null,null,null,null,"2025-03-12",11]
[null,null,null,null,null,null,"2025-03-13",11]
[null,null,null,null,null,null,"2025-03-14",11]
[null,null,null,null,null,null,"2025-03-15",11]
[null,null,null,null,null,null,"2025-03-16",11]
[null,null,null,null,null,null,"2025-03-17",12]
[null,null,null,null,null,null,"2025-03-18",12]
[null,null,null,null,null,null,"2025-03-19",12]
[null,null,null,null,null,null,"2025-03-20",12]
[null,null,null,null,null,null,"2025-03-21",12]
[null,null,null,null,null,null,"2025-03-22",12]
[null,null,null,null,null,null,"2025-03-23",12]
[null,null,null,null,null,null,"2025-03-24",13]
[null,null,null,null,null,null,"2025-03-25",13]
[null,null,null,null,null,null,"2025-03-26",13]
[null,null,null,null,null,null,"2025-03-27",13]
[null,null,null,null,null,null,"2025-03-28",13]
[null,null,null,null,null,null,"2025-03-29",13]
[null,null,null,null,null,null,"2025-03-30",13]
[null,null,null,null,null,null,"2025-03-31",14]
[null,null,null,null,null,null,"2025-04-01",14]
[null,null,null,null,null,null,"2025-04-02",14]
[null,null,null,null,null,null,"2025-04-03",14]
[null,null,null,null,null,null,"2025-04-04",14]
[null,null,null,null,null,null,"2025-04-05",14]
[null,null,null,null,null,null,"2025-04-06",14]
[null,null,null,null,null,null,"2025-04-07",15]
[null,null,null,null,null,null,"2025-04-08",15]
[null,null,null,null,null,null,"2025-04-09",15]
[null,null,null,null,null,null,"2025-04-10",15]
[null,null,null,null,null,null,"2025-04-11",15]
[null,null,null,null,null,null,"2025-04-12",15]
[null,null,null,null,null,null,"2025-04-13",15]
[null,null,null,null,null,null,"2025-04-14",16]
[null,null,null,null,null,null,"2025-04-15",16]
[null,null,null,null,null,null,"2025-04-16",16]
[null,null,null,null,null,null,"2025-04-17",16]
[null,null,null,null,null,null,"2025-04-18",16]
[null,null,null,null,null,null,"2025-04-19",16]
[null,null,null,null,null,null,"2025-04-20",16]
[null,null,null,null,null,null,"2025-04-21",17]
[null,null,null,null,null,null,"2025-04-22",17]
[null,null,null,null,null,null,"2025-04-23",17]
[null,null,null,null,null,null,"2025-04-24",17]
[null,null,null,null,null,null,"2025-04-25",17]
[null,null,null,null,null,null,"2025-04-26",17]
[null,null,null,null,null,null,"2025-04-27",17]
[null,null,null,null,null,null,"2025-04-28",18]
[null,null,null,null,null,null,"2025-04-29",18]
[null,null,null,null,null,null,"2025-04-30",18]
[null,null,null,null,null,null,"2025-05-01",18]
[null,null,null,null,null,null,"2025-05-02",18]
[null,null,null,null,null,null,"2025-05-03",18]
[null,null,null,null,null,null,"2025-05-04",18]
[null,null,null,null,null,null,"2025-05-05",19]
[null,null,null,null,null,null,"2025-05-06",19]
[null,null,null,null,null,null,"2025-05-07",19]
[null,null,null,null,null,null,"2025-05-08",19]
[null,null,null,null,null,null,"2025-05-09",19]
[null,null,null,null,null,null,"2025-05-10",19]
[null,null,null,null,null,null,"2025-05-11",19]
[null,null,null,null,null,null,"2025-05-12",20]
[null,null,null,null,null,null,"2025-05-13",20]
[null,null,null,null,null,null,"2025-05-14",20]
[null,null,null,null,null,null,"2025-05-15",20]
[null,null,null,null,null,null,"2025-05-16",20]
[null,null,null,null,null,null,"2025-05-17",20]
[null,null,null,null,null,null,"2025-05-18",20]
[null,null,null,null,null,null,"2025-05-19",21]
[null,null,null,null,null,null,"2025-05-20",21]
[null,null,null,null,null,null,"2025-05-21",21]
[null,null,null,null,null,null,"2025-05-22",21]
[null,null,null,null,null,null,"2025-05-23",21]
[null,null,null,null,null,null,"2025-05-24",21]
[null,null,null,null,null,null,"2025-05-25",21]
[null,null,null,null,null,null,"2025-05-26",22]
[null,null,null,null,null,null,"2025-05-27",22]
[null,null,null,null,null,null,"2025-05-28",22]
[null,null,null,null,null,null,"2025-05-29",22]
[null,null,null,null,null,null,"2025-05-30",22]
[null,null,null,null,null,null,"2025-05-31",22]
[null,null,null,null,null,null,"2025-06-01",22]
[null,null,null,null,null,null,"2025-06-02",23]
[null,null,null,null,null,null,"2025-06-03",23]
[null,null,null,null,null,null,"2025-06-04",23]
[null,null,null,null,null,null,"2025-06-05",23]
[null,null,null,null,null,null,"2025-06-06",23]
[null,null,null,null,null,null,"2025-06-07",23]
[null,null,null,null,null,null,"2025-06-08",23]
[null,null,null,null,null,null,"2025-06-09",24]
[null,null,null,null,null,null,"2025-06-10",24]
[null,null,null,null,null,null,"2025-06-11",24]
[null,null,null,null,null,null,"2025-06-12",24]
[null,null,null,null,null,null,"2025-06-13",24]
[null,null,null,null,null,null,"2025-06-14",24]
[null,null,null,null,null,null,"2025-06-15",24]
[null,null,null,null,null,null,"2025-06-16",25]
[null,null,null,null,null,null,"2025-06-17",25]
[null,null,null,null,null,null,"2025-06-18",25]
[null,null,null,null,null,null,"2025-06-19",25]
[null,null,null,null,null,null,"2025-06-20",25]
[null,null,null,null,null,null,"2025-06-21",25]
[null,null,null,null,null,null,"2025-06-22",25]
[null,null,null,null,null,null,"2025-06-23",26]
[null,null,null,null,null,null,"2025-06-24",26]
[null,null,null,null,null,null,"2025-06-25",26]
[null,null,null,null,null,null,"2025-06-26",26]
[null,null,null,null,null,null,"2025-06-27",26]
[null,null,null,null,null,null,"2025-06-28",26]
[null,null,null,null,null,null,"2025-06-29",26]
[null,null,null,null,null,null,"2025-06-30",27]
[null,null,null,null,null,null,"2025-07-01",27]
[null,null,null,null,null,null,"2025-07-02",27]
[null,null,null,null,null,null,"2025-07-03",27]
[null,null,null,null,null,null,"2025-07-04",27]
[null,null,null,null,null,null,"2025-07-05",27]
[null,null,null,null,null,null,"2025-07-06",27]
[null,null,null,null,null,null,"2025-07-07",28]
[null,null,null,null,null,null,"2025-07-08",28]
[null,null,null,null,null,null,"2025-07-09",28]
[null,null,null,null,null,null,"2025-07-10",28]
[null,null,null,null,null,null,"2025-07-11",28]
[null,null,null,null,null,null,"2025-07-12",28]
[null,null,null,null,null,null,"2025-07-13",28]
[null,null,null,null,null,null,"2025-07-14",29]
[null,null,null,null,null,null,"2025-07-15",29]
[null,null,null,null,null,null,"2025-07-16",29]
[null,null,null,null,null,null,"2025-07-17",29]
[null,null,null,null,null,null,"2025-07-18",29]
[null,null,null,null,null,null,"2025-07-19",29]
[null,null,null,null,null,null,"2025-07-20",29]
[null,null,null,null,null,null,"2025-07-21",30]
[null,null,null,null,null,null,"2025-07-22",30]
[null,null,null,null,null,null,"2025-07-23",30]
[null,null,null,null,null,null,"2025-07-24",30]
[null,null,null,null,null,null,"2025-07-25",30]
[null,null,null,null,null,null,"2025-07-26",30]
[null,null,null,null,null,null,"2025-07-27",30]
[null,null,null,null,null,null,"2025-07-28",31]
[null,null,null,null,null,null,"2025-07-29",31]
[null,null,null,null,null,null,"2025-07-30",31]
[null,null,null,null,null,null,"2025-07-31",31]
[null,null,null,null,null,null,"2025-08-01",31]
[null,null,null,null,null,null,"2025-08-02",31]
[null,null,null,null,null,null,"2025-08-03",31]
[null,null,null,null,null,null,"2025-08-04",32]
[null,null,null,null,null,null,"2025-08-05",32]
[null,null,null,null,null,null,"2025-08-06",32]
[null,null,null,null,null,null,"2025-08-07",32]
[null,null,null,null,null,null,"2025-08-08",32]
[null,null,null,null,null,null,"2025-08-09",32]
[null,null,null,null,null,null,"2025-08-10",32]
[null,null,null,null,null,null,"2025-08-11",33]
[null,null,null,null,null,null,"2025-08-12",33]
[null,null,null,null,null,null,"2025-08-13",33]
[null,null,null,null,null,null,"2025-08-14",33]
[null,null,null,null,null,null,"2025-08-15",33]
[null,null,null,null,null,null,"2025-08-16",33]
[null,null,null,null,null,null,"2025-08-17",33]
[null,null,null,null,null,null,"2025-08-18",34]
[null,null,null,null,null,null,"2025-08-19",34]
[null,null,null,null,null,null,"2025-08-20",34]
[null,null,null,null,null,null,"2025-08-21",34]
[null,null,null,null,null,null,"2025-08-22",34]
[null,null,null,null,null,null,"2025-08-23",34]
[null,null,null,null,null,null,"2025-08-24",34]
[null,null,null,null,null,null,"2025-08-25",35]
[null,null,null,null,null,null,"2025-08-26",35]
[null,null,null,null,null,null,"2025-08-27",35]
[null,null,null,null,null,null,"2025-08-28",35]
[null,null,null,null,null,null,"2025-08-29",35]
[null,null,null,null,null,null,"2025-08-30",35]
[null,null,null,null,null,null,"2025-08-31",35]
[null,null,null,null,null,null,"2025-09-01",36]
[null,null,null,null,null,null,"2025-09-02",36]
[null,null,null,null,null,null,"2025-09-03",36]
[null,null,null,null,null,null,"2025-09-04",36]
[null,null,null,null,null,null,"2025-09-05",36]
[null,null,null,null,null,null,"2025-09-06",36]
[null,null,null,null,null,null,"2025-09-07",36]
[null,null,null,null,null,null,"2025-09-08",37]
[null,null,null,null,null,null,"2025-09-09",37]
[null,null,null,null,null,null,"2025-09-10",37]
[null,null,null,null,null,null,"2025-09-11",37]
[null,null,null,null,null,null,"2025-09-12",37]
[null,null,null,null,null,null,"2025-09-13",37]
[null,null,null,null,null,null,"2025-09-14",37]
[null,null,null,null,null,null,"2025-09-15",38]
[null,null,null,null,null,null,"2025-09-16",38]
[null,null,null,null,null,null,"2025-09-17",38]
[null,null,null,null,null,null,"2025-09-18",38]
[null,null,null,null,null,null,"2025-09-19",38]
[null,null,null,null,null,null,"2025-09-20",38]
[null,null,null,null,null,null,"2025-09-21",38]
[null,null,null,null,null,null,"2025-09-22",39]
[null,null,null,null,null,null,"2025-09-23",39]
[null,null,null,null,null,null,"2025-09-24",39]
[null,null,null,null,null,null,"2025-09-25",39]
[null,null,null,null,null,null,"2025-09-26",39]
[null,null,null,null,null,null,"2025-09-27",39]
[null,null,null,null,null,null,"2025-09-28",39]
[null,null,null,null,null,null,"2025-09-29",40]
[null,null,null,null,null,null,"2025-09-30",40]
[null,null,null,null,null,null,"2025-10-01",40]
[null,null,null,null,null,null,"2025-10-02",40]
[null,null,null,null,null,null,"2025-10-03",40]
[null,null,null,null,null,null,"2025-10-04",40]
[null,null,null,null,null,null,"2025-10-05",40]
[null,null,null,null,null,null,"2025-10-06",41]
[null,null,null,null,null,null,"2025-10-07",41]
[null,null,null,null,null,null,"2025-10-08",41]
[null,null,null,null,null,null,"2025-10-09",41]
[null,null,null,null,null,null,"2025-10-10",41]
[null,null,null,null,null,null,"2025-10-11",41]
[null,null,null,null,null,null,"2025-10-12",41]
[null,null,null,null,null,null,"2025-10-13",42]
[null,null,null,null,null,null,"2025-10-14",42]
[null,null,null,null,null,null,"2025-10-15",42]
[null,null,null,null,null,null,"2025-10-16",42]
[null,null,null,null,null,null,"2025-10-17",42]
[null,null,null,null,null,null,"2025-10-18",42]
[null,null,null,null,null,null,"2025-10-19",42]
[null,null,null,null,null,null,"2025-10-20",43]
[null,null,null,null,null,null,"2025-10-21",43]
[null,null,null,null,null,null,"2025-10-22",43]
[null,null,null,null,null,null,"2025-10-23",43]
[null,null,null,null,null,null,"2025-10-24",43]
[null,null,null,null,null,null,"2025-10-25",43]
[null,null,null,null,null,null,"2025-10-26",43]
[null,null,null,null,null,null,"2025-10-27",44]
[null,null,null,null,null,null,"2025-10-28",44]
[null,null,null,null,null,null,"2025-10-29",44]
[null,null,null,null,null,null,"2025-10-30",44]
[null,null,null,null,null,null,"2025-10-31",44]
[null,null,null,null,null,null,"2025-11-01",44]
[null,null,null,null,null,null,"2025-11-02",44]
[null,null,null,null,null,null,"2025-11-03",45]
[null,null,null,null,null,null,"2025-11-04",45]
[null,null,null,null,null,null,"2025-11-05",45]
[null,null,null,null,null,null,"2025-11-06",45]
[null,null,null,null,null,null,"2025-11-07",45]
[null,null,null,null,null,null,"2025-11-08",45]
[null,null,null,null,null,null,"2025-11-09",45]
[null,null,null,null,null,null,"2025-11-10",46]
[null,null,null,null,null,null,"2025-11-11",46]
[null,null,null,null,null,null,"2025-11-12",46]
[null,null,null,null,null,null,"2025-11-13",46]
[null,null,null,null,null,null,"2025-11-14",46]
[null,null,null,null,null,null,"2025-11-15",46]
[null,null,null,null,null,null,"2025-11-16",46]
[null,null,null,null,null,null,"2025-11-17",47]
[null,null,null,null,null,null,"2025-11-18",47]
[null,null,null,null,null,null,"2025-11-19",47]
[null,null,null,null,null,null,"2025-11-20",47]
[null,null,null,null,null,null,"2025-11-21",47]
[null,null,null,null,null,null,"2025-11-22",47]
[null,null,null,null,null,null,"2025-11-23",47]
[null,null,null,null,null,null,"2025-11-24",48]
[null,null,null,null,null,null,"2025-11-25",48]
[null,null,null,null,null,null,"2025-11-26",48]
[null,null,null,null,null,null,"2025-11-27",48]
[null,null,null,null,null,null,"2025-11-28",48]
[null,null,null,null,null,null,"2025-11-29",48]
[null,null,null,null,null,null,"2025-11-30",48]
[null,null,null,null,null,null,"2025-12-01",49]
[null,null,null,null,null,null,"2025-12-02",49]
[null,null,null,null,null,null,"2025-12-03",49]
[null,null,null,null,null,null,"2025-12-04",49]
[null,null,null,null,null,null,"2025-12-05",49]
[null,null,null,null,null,null,"2025-12-06",49]
[null,null,null,null,null,null,"2025-12-07",49]
[null,null,null,null,null,null,"2025-12-08",50]
[null,null,null,null,null,null,"2025-12-09",50]
[null,null,null,null,null,null,"2025-12-10",50]
[null,null,null,null,null,null,"2025-12-11",50]
[null,null,null,null,null,null,"2025-12-12",50]
[null,null,null,null,null,null,"2025-12-13",50]
[null,null,null,null,null,null,"2025-12-14",50]
[null,null,null,null,null,null,"2025-12-15",51]
[null,null,null,null,null,null,"2025-12-16",51]
[null,null,null,null,null,null,"2025-12-17",51]
[null,null,null,null,null,null,"2025-12-18",51]
[null,null,null,null,null,null,"2025-12-19",51]
[null,null,null,null,null,null,"2025-12-20",51]
[null,null,null,null,null,null,"2025-12-21",51]
[null,null,null,null,null,null,"2025-12-22",52]
[null,null,null,null,null,null,"2025-12-23",52]
[null,null,null,null,null,null,"2025-12-24",52]
[null,null,null,null,null,null,"2025-12-25",52]
[null,null,null,null,null,null,"2025-12-26",52]
[null,null,null,null,null,null,"2025-12-27",52]
[null,null,null,null,null,null,"2025-12-28",52]
[null,null,null,null,null,null,"2025-12-29",1]
[null,null,null,null,null,null,"2025-12-30",1]
[null,null,null,null,null,null,"2025-12-31",1]