{"text_format":"1","workbook":"xlsx","n_sheets":6,"sheets":["Voorblad","Home","Project","Contentoverzicht","Acties","Lijsten"],"not_rendered":{"charts":0,"images":5,"macros":1,"external_links":0,"defined_names":4,"comments":0,"pivot_tables":0},"unopened":[],"bounds":{"document_bytes":16777216,"sheet_cells":100000,"rows_first":2000,"rows_last":500,"rows_between":2000,"halvings":0,"cell_chars":16384,"cell_head_chars":4096},"cells_cut":0,"cells_raw":0,"read":"whole","date_system":"1900"}

{"sheet":"Voorblad","index":0,"n_rows":34,"n_cols":6,"rows_kept":34,"cut":false,"hidden":false,"merged":[[6,1,6,5]]}
[]
[]
[]
[null,"Werkt de bovenstaande knop niet, dan moet je eerst de onderstaande stappen doorlopen om de macro's te deblokkeren."]
[]
[null,"Dit bestand bevat macro's"]
[null,"In nieuwere versies van Excel is door Microsoft een extra beveiliging geplaatst op het openen van bestanden met macro’s. \nNaast dat macro's erg nuttig kunnen zijn worden ze ook misbruikt voor malware en ransomware. Door de macro's standaard te blokkeren wil Microsoft de strijd aan gaan tegen cybercriminaliteit."]
[null,"Dit Exceldocument bevat macro's om een goede werking van het bestand te garanderen. Deblokkeren van het bestand doet u als volgt:"]
[]
[null,"Stap 1. Blokkade opheffen",null,null,"Stap 2. Macro's inschakelen"]
[null,"a.","U moet het bestand opslaan op een lokale harde schijf (of OneDrive). ",null,"Nadat je de blokkering van het Excelbestand hebt opgeheven, is het (vaak) ook nog nodig om de macro’s in te schakelen."]
[null,"b.","Open Windows Verkenner en zoek het bestand op. "]
[null,"c.","Klik vervolgens met de rechtermuisknop op het bestand en kies Eigenschappen in het contextmenu. \nOnderaan het tabblad Algemeen ziet u een sectie Beveiliging. Schakel het selectievakje Blokkering opheffen in. \n",null,"a.","Dit zie je doordat je een pop-up krijgt met de melding: ‘Microsoft Office heeft een mogelijk beveiligingsprobleem geïdentificeerd.’ of door een gele balk bovenin je Excelbestand met daarin de tekst: ‘BEVEILIGINGSWAARSCHUWING \nMacro’s zijn uitgeschakeld.’ Zie ook afbeeldingen 2 en 3."]
[null,null,"En klik op OK. Zie ook afbeelding 1",null,"b.","In deze gevallen kun je de macro’s inschakelen door op de knop ‘Macro’s inschakelen’ te klikken in het pop-up scherm, of \nop de knop ‘Inhoud inschakelen’ in de gele balk"]
[null,null,"Wanneer u nu het bestand (opnieuw) opent zullen de macro's in het bestand werkzaam zijn."]
[null,null,"Afbeelding 1",null,null,"Afbeelding 2                                                                                                    Afbeelding 3"]
[]
[]
[]
[]
[]
[]
[]
[]
[]
[]
[]
[]
[]
[]
[]
[]
[]
[null,"Deze handleiding is ook terug te lezen via deze link."]

{"sheet":"Home","index":1,"n_rows":10,"n_cols":20,"rows_kept":10,"cut":false,"hidden":false,"merged":[]}
[null,null,null,null,null,null,null,null,null,null,null,null,null,null,null,null,null,"Datum start"]
[null,null,{"$f":"TODAY()","v":"2026-01-06"},null,null,null,null,null,null,null,null,null,null,null,null,null,null,"Datum nu",{"$f":"TODAY()","v":"2026-01-06"}]
[null,null,{"$f":"C2-C1","v":46028},null,"Contentplanning",null,null,null,null,null,null,null,null,null,null,null,null,"Verschil",{"$f":"S2-S1","v":"2026-01-06"}]
[null,null,null,null,null,null,null,null,null,null,null,null,null,null,null,null,null,"Check 1"]
[null,null,null,null,null,null,null,null,null,null,null,null,null,null,null,null,null,"Check 2"]
[null,null,null,null,null,null,null,null,null,null,null,null,null,null,null,null,null,"Check 3"]
[null,null,null,null,null,null,null,null,null,null,null,null,null,null,null,null,null,"Check 4"]
[null,null,null,null,null,null,null,null,null,null,null,null,null,null,null,null,null,"Check 5"]
[null,null,null,null,null,null,null,null,null,null,null,null,null,null,null,null,"*","*",null,"info@terzake-excel.nl"]
[null,null,null,null,null,null,null,null,null,null,null,null,null,null,null,null,"(","(",null,"0317 200 009"]

{"sheet":"Project","index":2,"n_rows":3,"n_cols":5,"rows_kept":3,"cut":false,"hidden":false,"merged":[]}
[]
[]
["Project","Van datum","Tot datum","Omschrijving","Status"]

{"sheet":"Contentoverzicht","index":3,"n_rows":6,"n_cols":61,"rows_kept":6,"cut":false,"hidden":false,"merged":[[3,8,3,10],[3,11,3,13],[3,14,3,16],[3,17,3,19]]}
[null,null,{"$f":"COUNTIFS(Project!B:B,\">=\"&A4)","v":0},null,{"$f":"COUNTIFS(Acties!A:A,\">=\"&A4)","v":0}]
[]
["Vanaf datum"]
["2026-01-01",null,null,null,null,null,null,{"$f":"IF(Lijsten!$C$4=0,\"\",Lijsten!$C$4)","v":"opmeting"},{"$f":"IF(Lijsten!$C$5=0,\"\",Lijsten!$C$5)","v":"nt gepland"},null,null,{"$f":"IF(Lijsten!$C$6=0,\"\",Lijsten!$C$6)","v":"gepland"},null,null,{"$f":"IF(Lijsten!$C$7=0,\"\",Lijsten!$C$7)","v":"in uitvoering"},null,null,{"$f":"IF(Lijsten!$C$8=0,\"\",Lijsten!$C$8)","v":"uitgevoerd"}]
[null,null,null,null,null,null,null,null,{"$f":"A4","v":"2026-01-01"},{"$f":"I5+7","v":"2026-01-08"},{"$f":"J5+7","v":"2026-01-15"},"2026-01-22","2026-01-29","2026-02-05","2026-02-12","2026-02-19","2026-02-26","2026-03-05","2026-03-12","2026-03-19","2026-03-26","2026-04-02","2026-04-09","2026-04-16","2026-04-23","2026-04-30","2026-05-07","2026-05-14","2026-05-21","2026-05-28","2026-06-04","2026-06-11","2026-06-18","2026-06-25","2026-07-02","2026-07-09","2026-07-16","2026-07-23","2026-07-30","2026-08-06","2026-08-13","2026-08-20","2026-08-27","2026-09-03","2026-09-10","2026-09-17","2026-09-24","2026-10-01","2026-10-08","2026-10-15","2026-10-22","2026-10-29","2026-11-05","2026-11-12","2026-11-19","2026-11-26","2026-12-03","2026-12-10","2026-12-17","2026-12-24","2026-12-31"]
["Project","Actie","Datum","Van datum","Tot datum","Kanaal","Omschrijving","Status",{"$f":"A4","v":"2026-01-01"},{"$f":"I6+1","v":"2026-01-02"},{"$f":"J6+1","v":"2026-01-03"},"2026-01-04","2026-01-05","2026-01-06","2026-01-07","2026-01-08","2026-01-09","2026-01-10","2026-01-11","2026-01-12","2026-01-13","2026-01-14","2026-01-15","2026-01-16","2026-01-17","2026-01-18","2026-01-19","2026-01-20","2026-01-21","2026-01-22","2026-01-23","2026-01-24","2026-01-25","2026-01-26","2026-01-27","2026-01-28","2026-01-29","2026-01-30","2026-01-31",{"$f":"VLOOKUP(AN5,Lijsten!$G:$H,2,FALSE)","v":{"$error":"#N/A"}},{"$f":"VLOOKUP(AO5,Lijsten!$G:$H,2,FALSE)","v":{"$error":"#N/A"}},{"$f":"VLOOKUP(AP5,Lijsten!$G:$H,2,FALSE)","v":{"$error":"#N/A"}},{"$f":"VLOOKUP(AQ5,Lijsten!$G:$H,2,FALSE)","v":{"$error":"#N/A"}},{"$f":"VLOOKUP(AR5,Lijsten!$G:$H,2,FALSE)","v":{"$error":"#N/A"}},{"$f":"VLOOKUP(AS5,Lijsten!$G:$H,2,FALSE)","v":{"$error":"#N/A"}},{"$f":"VLOOKUP(AT5,Lijsten!$G:$H,2,FALSE)","v":{"$error":"#N/A"}},{"$f":"VLOOKUP(AU5,Lijsten!$G:$H,2,FALSE)","v":{"$error":"#N/A"}},{"$f":"VLOOKUP(AV5,Lijsten!$G:$H,2,FALSE)","v":{"$error":"#N/A"}},{"$f":"VLOOKUP(AW5,Lijsten!$G:$H,2,FALSE)","v":{"$error":"#N/A"}},{"$f":"VLOOKUP(AX5,Lijsten!$G:$H,2,FALSE)","v":{"$error":"#N/A"}},{"$f":"VLOOKUP(AY5,Lijsten!$G:$H,2,FALSE)","v":{"$error":"#N/A"}},{"$f":"VLOOKUP(AZ5,Lijsten!$G:$H,2,FALSE)","v":{"$error":"#N/A"}},{"$f":"VLOOKUP(BA5,Lijsten!$G:$H,2,FALSE)","v":{"$error":"#N/A"}},{"$f":"VLOOKUP(BB5,Lijsten!$G:$H,2,FALSE)","v":{"$error":"#N/A"}},{"$f":"VLOOKUP(BC5,Lijsten!$G:$H,2,FALSE)","v":{"$error":"#N/A"}},{"$f":"VLOOKUP(BD5,Lijsten!$G:$H,2,FALSE)","v":{"$error":"#N/A"}},{"$f":"VLOOKUP(BE5,Lijsten!$G:$H,2,FALSE)","v":{"$error":"#N/A"}},{"$f":"VLOOKUP(BF5,Lijsten!$G:$H,2,FALSE)","v":{"$error":"#N/A"}},{"$f":"VLOOKUP(BG5,Lijsten!$G:$H,2,FALSE)","v":{"$error":"#N/A"}},{"$f":"VLOOKUP(BH5,Lijsten!$G:$H,2,FALSE)","v":{"$error":"#N/A"}},{"$f":"VLOOKUP(BI5,Lijsten!$G:$H,2,FALSE)","v":{"$error":"#N/A"}}]

{"sheet":"Acties","index":4,"n_rows":2003,"n_cols":9,"rows_kept":2003,"cut":false,"hidden":false,"merged":[]}
[]
[]
["Datum","Dag","Maand","Jaar","Project","Actie","Kanaal","Omschrijving","Status"]
[]
[null,{"$f":"WEEKDAY(A5,2)","v":6},{"$f":"MONTH(A5)","v":1},{"$f":"YEAR(A5)","v":1900}]
[null,6,1,1900]
[null,6,1,1900]
[null,6,1,1900]
[null,6,1,1900]
[null,6,1,1900]
[null,6,1,1900]
[null,6,1,1900]
[null,6,1,1900]
[null,6,1,1900]
[null,6,1,1900]
[null,6,1,1900]
[null,6,1,1900]
[null,6,1,1900]
[null,6,1,1900]
[null,6,1,1900]
[null,6,1,1900]
[null,6,1,1900]
[null,6,1,1900]
[null,6,1,1900]
[null,6,1,1900]
[null,6,1,1900]
[null,6,1,1900]
[null,6,1,1900]
[null,6,1,1900]
[null,6,1,1900]
[null,6,1,1900]
[null,6,1,1900]
[null,6,1,1900]
[null,6,1,1900]
[null,6,1,1900]
[null,6,1,1900]
[null,6,1,1900]
[null,6,1,1900]
[null,6,1,1900]
[null,6,1,1900]
[null,6,1,1900]
[null,6,1,1900]
[null,6,1,1900]
[null,6,1,1900]
[null,6,1,1900]
[null,6,1,1900]
[null,6,1,1900]
[null,6,1,1900]
[null,6,1,1900]
[null,6,1,1900]
[null,6,1,1900]
[null,6,1,1900]
[null,6,1,1900]
[null,6,1,1900]
[null,6,1,1900]
[null,6,1,1900]
[null,6,1,1900]
[null,6,1,1900]
[null,6,1,1900]
[null,6,1,1900]
[null,6,1,1900]
[null,6,1,1900]
[null,6,1,1900]
[null,6,1,1900]
[null,6,1,1900]
[null,6,1,1900]
[null,6,1,1900]
[null,6,1,1900]
[null,{"$f":"WEEKDAY(A69,2)","v":6},{"$f":"MONTH(A69)","v":1},{"$f":"YEAR(A69)","v":1900}]
[null,6,1,1900]
[null,6,1,1900]
[null,6,1,1900]
[null,6,1,1900]
[null,6,1,1900]
[null,6,1,1900]
[null,6,1,1900]
[null,6,1,1900]
[null,6,1,1900]
[null,6,1,1900]
[null,6,1,1900]
[null,6,1,1900]
[null,6,1,1900]
[null,6,1,1900]
[null,6,1,1900]
[null,6,1,1900]
[null,6,1,1900]
[null,6,1,1900]
[null,6,1,1900]
[null,6,1,1900]
[null,6,1,1900]
[null,6,1,1900]
[null,6,1,1900]
[null,6,1,1900]
[null,6,1,1900]
[null,6,1,1900]
[null,6,1,1900]
[null,6,1,1900]
[null,6,1,1900]
[null,6,1,1900]
[null,6,1,1900]
[null,6,1,1900]
[null,6,1,1900]
[null,6,1,1900]
[null,6,1,1900]
[null,6,1,1900]
[null,6,1,1900]
[null,6,1,1900]
[null,6,1,1900]
[null,6,1,1900]
[null,6,1,1900]
[null,6,1,1900]
[null,6,1,1900]
[null,6,1,1900]
[null,6,1,1900]
[null,6,1,1900]
[null,6,1,1900]
[null,6,1,1900]
[null,6,1,1900]
[null,6,1,1900]
[null,6,1,1900]
[null,6,1,1900]
[null,6,1,1900]
[null,6,1,1900]
[null,6,1,1900]
[null,6,1,1900]
[null,6,1,1900]
[null,6,1,1900]
[null,6,1,1900]
[null,6,1,1900]
[null,6,1,1900]
[null,6,1,1900]
[null,6,1,1900]
[null,{"$f":"WEEKDAY(A133,2)","v":6},{"$f":"MONTH(A133)","v":1},{"$f":"YEAR(A133)","v":1900}]
[null,6,1,1900]
[null,6,1,1900]
[null,6,1,1900]
[null,6,1,1900]
[null,6,1,1900]
[null,6,1,1900]
[null,6,1,1900]
[null,6,1,1900]
[null,6,1,1900]
[null,6,1,1900]
[null,6,1,1900]
[null,6,1,1900]
[null,6,1,1900]
[null,6,1,1900]
[null,6,1,1900]
[null,6,1,1900]
[null,6,1,1900]
[null,6,1,1900]
[null,6,1,1900]
[null,6,1,1900]
[null,6,1,1900]
[null,6,1,1900]
[null,6,1,1900]
[null,6,1,1900]
[null,6,1,1900]
[null,6,1,1900]
[null,6,1,1900]
[null,6,1,1900]
[null,6,1,1900]
[null,6,1,1900]
[null,6,1,1900]
[null,6,1,1900]
[null,6,1,1900]
[null,6,1,1900]
[null,6,1,1900]
[null,6,1,1900]
[null,6,1,1900]
[null,6,1,1900]
[null,6,1,1900]
[null,6,1,1900]
[null,6,1,1900]
[null,6,1,1900]
[null,6,1,1900]
[null,6,1,1900]
[null,6,1,1900]
[null,6,1,1900]
[null,6,1,1900]
[null,6,1,1900]
[null,6,1,1900]
[null,6,1,1900]
[null,6,1,1900]
[null,6,1,1900]
[null,6,1,1900]
[null,6,1,1900]
[null,6,1,1900]
[null,6,1,1900]
[null,6,1,1900]
[null,6,1,1900]
[null,6,1,1900]
[null,6,1,1900]
[null,6,1,1900]
[null,6,1,1900]
[null,6,1,1900]
[null,{"$f":"WEEKDAY(A197,2)","v":6},{"$f":"MONTH(A197)","v":1},{"$f":"YEAR(A197)","v":1900}]
[null,6,1,1900]
[null,6,1,1900]
[null,6,1,1900]
{"$rows_left_out":1804}
{"sheet":"Lijsten","index":5,"n_rows":3655,"n_cols":8,"rows_kept":3655,"cut":false,"hidden":false,"merged":[]}
[]
[]
["Kanalen",null,"Statussen",null,null,null,"2016-01-01",53]
["Enwbrief",null,"opmeting",null,null,null,"2016-01-02",53]
["Linkedin",null,"nt gepland",null,null,null,"2016-01-03",53]
["E-mail/Enquete",null,"gepland",null,null,null,"2016-01-04",1]
["Twitter",null,"in uitvoering",null,null,null,"2016-01-05",1]
[null,null,"uitgevoerd",null,null,null,"2016-01-06",1]
[null,null,null,null,null,null,"2016-01-07",1]
[null,null,null,null,null,null,"2016-01-08",1]
[null,null,null,null,null,null,"2016-01-09",1]
[null,null,null,null,null,null,"2016-01-10",1]
[null,null,null,null,null,null,"2016-01-11",2]
[null,null,null,null,null,null,"2016-01-12",2]
[null,null,null,null,null,null,"2016-01-13",2]
[null,null,null,null,null,null,"2016-01-14",2]
[null,null,null,null,null,null,"2016-01-15",2]
[null,null,null,null,null,null,"2016-01-16",2]
[null,null,null,null,null,null,"2016-01-17",2]
[null,null,null,null,null,null,"2016-01-18",3]
[null,null,null,null,null,null,"2016-01-19",3]
[null,null,null,null,null,null,"2016-01-20",3]
[null,null,null,null,null,null,"2016-01-21",3]
[null,null,null,null,null,null,"2016-01-22",3]
[null,null,null,null,null,null,"2016-01-23",3]
[null,null,null,null,null,null,"2016-01-24",3]
[null,null,null,null,null,null,"2016-01-25",4]
[null,null,null,null,null,null,"2016-01-26",4]
[null,null,null,null,null,null,"2016-01-27",4]
[null,null,null,null,null,null,"2016-01-28",4]
[null,null,null,null,null,null,"2016-01-29",4]
[null,null,null,null,null,null,"2016-01-30",4]
[null,null,null,null,null,null,"2016-01-31",4]
[null,null,null,null,null,null,"2016-02-01",5]
[null,null,null,null,null,null,"2016-02-02",5]
[null,null,null,null,null,null,"2016-02-03",5]
[null,null,null,null,null,null,"2016-02-04",5]
[null,null,null,null,null,null,"2016-02-05",5]
[null,null,null,null,null,null,"2016-02-06",5]
[null,null,null,null,null,null,"2016-02-07",5]
[null,null,null,null,null,null,"2016-02-08",6]
[null,null,null,null,null,null,"2016-02-09",6]
[null,null,null,null,null,null,"2016-02-10",6]
[null,null,null,null,null,null,"2016-02-11",6]
[null,null,null,null,null,null,"2016-02-12",6]
[null,null,null,null,null,null,"2016-02-13",6]
[null,null,null,null,null,null,"2016-02-14",6]
[null,null,null,null,null,null,"2016-02-15",7]
[null,null,null,null,null,null,"2016-02-16",7]
[null,null,null,null,null,null,"2016-02-17",7]
[null,null,null,null,null,null,"2016-02-18",7]
[null,null,null,null,null,null,"2016-02-19",7]
[null,null,null,null,null,null,"2016-02-20",7]
[null,null,null,null,null,null,"2016-02-21",7]
[null,null,null,null,null,null,"2016-02-22",8]
[null,null,null,null,null,null,"2016-02-23",8]
[null,null,null,null,null,null,"2016-02-24",8]
[null,null,null,null,null,null,"2016-02-25",8]
[null,null,null,null,null,null,"2016-02-26",8]
[null,null,null,null,null,null,"2016-02-27",8]
[null,null,null,null,null,null,"2016-02-28",8]
[null,null,null,null,null,null,"2016-02-29",9]
[null,null,null,null,null,null,"2016-03-01",9]
[null,null,null,null,null,null,"2016-03-02",9]
[null,null,null,null,null,null,"2016-03-03",9]
[null,null,null,null,null,null,"2016-03-04",9]
[null,null,null,null,null,null,"2016-03-05",9]
[null,null,null,null,null,null,"2016-03-06",9]
[null,null,null,null,null,null,"2016-03-07",10]
[null,null,null,null,null,null,"2016-03-08",10]
[null,null,null,null,null,null,"2016-03-09",10]
[null,null,null,null,null,null,"2016-03-10",10]
[null,null,null,null,null,null,"2016-03-11",10]
[null,null,null,null,null,null,"2016-03-12",10]
[null,null,null,null,null,null,"2016-03-13",10]
[null,null,null,null,null,null,"2016-03-14",11]
[null,null,null,null,null,null,"2016-03-15",11]
[null,null,null,null,null,null,"2016-03-16",11]
[null,null,null,null,null,null,"2016-03-17",11]
[null,null,null,null,null,null,"2016-03-18",11]
[null,null,null,null,null,null,"2016-03-19",11]
[null,null,null,null,null,null,"2016-03-20",11]
[null,null,null,null,null,null,"2016-03-21",12]
[null,null,null,null,null,null,"2016-03-22",12]
[null,null,null,null,null,null,"2016-03-23",12]
[null,null,null,null,null,null,"2016-03-24",12]
[null,null,null,null,null,null,"2016-03-25",12]
[null,null,null,null,null,null,"2016-03-26",12]
[null,null,null,null,null,null,"2016-03-27",12]
[null,null,null,null,null,null,"2016-03-28",13]
[null,null,null,null,null,null,"2016-03-29",13]
[null,null,null,null,null,null,"2016-03-30",13]
[null,null,null,null,null,null,"2016-03-31",13]
[null,null,null,null,null,null,"2016-04-01",13]
[null,null,null,null,null,null,"2016-04-02",13]
[null,null,null,null,null,null,"2016-04-03",13]
[null,null,null,null,null,null,"2016-04-04",14]
[null,null,null,null,null,null,"2016-04-05",14]
[null,null,null,null,null,null,"2016-04-06",14]
[null,null,null,null,null,null,"2016-04-07",14]
[null,null,null,null,null,null,"2016-04-08",14]
[null,null,null,null,null,null,"2016-04-09",14]
[null,null,null,null,null,null,"2016-04-10",14]
[null,null,null,null,null,null,"2016-04-11",15]
[null,null,null,null,null,null,"2016-04-12",15]
[null,null,null,null,null,null,"2016-04-13",15]
[null,null,null,null,null,null,"2016-04-14",15]
[null,null,null,null,null,null,"2016-04-15",15]
[null,null,null,null,null,null,"2016-04-16",15]
[null,null,null,null,null,null,"2016-04-17",15]
[null,null,null,null,null,null,"2016-04-18",16]
[null,null,null,null,null,null,"2016-04-19",16]
[null,null,null,null,null,null,"2016-04-20",16]
[null,null,null,null,null,null,"2016-04-21",16]
[null,null,null,null,null,null,"2016-04-22",16]
[null,null,null,null,null,null,"2016-04-23",16]
[null,null,null,null,null,null,"2016-04-24",16]
[null,null,null,null,null,null,"2016-04-25",17]
[null,null,null,null,null,null,"2016-04-26",17]
[null,null,null,null,null,null,"2016-04-27",17]
[null,null,null,null,null,null,"2016-04-28",17]
[null,null,null,null,null,null,"2016-04-29",17]
[null,null,null,null,null,null,"2016-04-30",17]
[null,null,null,null,null,null,"2016-05-01",17]
[null,null,null,null,null,null,"2016-05-02",18]
[null,null,null,null,null,null,"2016-05-03",18]
[null,null,null,null,null,null,"2016-05-04",18]
[null,null,null,null,null,null,"2016-05-05",18]
[null,null,null,null,null,null,"2016-05-06",18]
[null,null,null,null,null,null,"2016-05-07",18]
[null,null,null,null,null,null,"2016-05-08",18]
[null,null,null,null,null,null,"2016-05-09",19]
[null,null,null,null,null,null,"2016-05-10",19]
[null,null,null,null,null,null,"2016-05-11",19]
[null,null,null,null,null,null,"2016-05-12",19]
[null,null,null,null,null,null,"2016-05-13",19]
[null,null,null,null,null,null,"2016-05-14",19]
[null,null,null,null,null,null,"2016-05-15",19]
[null,null,null,null,null,null,"2016-05-16",20]
[null,null,null,null,null,null,"2016-05-17",20]
[null,null,null,null,null,null,"2016-05-18",20]
[null,null,null,null,null,null,"2016-05-19",20]
[null,null,null,null,null,null,"2016-05-20",20]
[null,null,null,null,null,null,"2016-05-21",20]
[null,null,null,null,null,null,"2016-05-22",20]
[null,null,null,null,null,null,"2016-05-23",21]
[null,null,null,null,null,null,"2016-05-24",21]
[null,null,null,null,null,null,"2016-05-25",21]
[null,null,null,null,null,null,"2016-05-26",21]
[null,null,null,null,null,null,"2016-05-27",21]
[null,null,null,null,null,null,"2016-05-28",21]
[null,null,null,null,null,null,"2016-05-29",21]
[null,null,null,null,null,null,"2016-05-30",22]
[null,null,null,null,null,null,"2016-05-31",22]
[null,null,null,null,null,null,"2016-06-01",22]
[null,null,null,null,null,null,"2016-06-02",22]
[null,null,null,null,null,null,"2016-06-03",22]
[null,null,null,null,null,null,"2016-06-04",22]
[null,null,null,null,null,null,"2016-06-05",22]
[null,null,null,null,null,null,"2016-06-06",23]
[null,null,null,null,null,null,"2016-06-07",23]
[null,null,null,null,null,null,"2016-06-08",23]
[null,null,null,null,null,null,"2016-06-09",23]
[null,null,null,null,null,null,"2016-06-10",23]
[null,null,null,null,null,null,"2016-06-11",23]
[null,null,null,null,null,null,"2016-06-12",23]
[null,null,null,null,null,null,"2016-06-13",24]
[null,null,null,null,null,null,"2016-06-14",24]
[null,null,null,null,null,null,"2016-06-15",24]
[null,null,null,null,null,null,"2016-06-16",24]
[null,null,null,null,null,null,"2016-06-17",24]
[null,null,null,null,null,null,"2016-06-18",24]
[null,null,null,null,null,null,"2016-06-19",24]
[null,null,null,null,null,null,"2016-06-20",25]
[null,null,null,null,null,null,"2016-06-21",25]
[null,null,null,null,null,null,"2016-06-22",25]
[null,null,null,null,null,null,"2016-06-23",25]
[null,null,null,null,null,null,"2016-06-24",25]
[null,null,null,null,null,null,"2016-06-25",25]
[null,null,null,null,null,null,"2016-06-26",25]
[null,null,null,null,null,null,"2016-06-27",26]
[null,null,null,null,null,null,"2016-06-28",26]
[null,null,null,null,null,null,"2016-06-29",26]
[null,null,null,null,null,null,"2016-06-30",26]
[null,null,null,null,null,null,"2016-07-01",26]
[null,null,null,null,null,null,"2016-07-02",26]
[null,null,null,null,null,null,"2016-07-03",26]
[null,null,null,null,null,null,"2016-07-04",27]
[null,null,null,null,null,null,"2016-07-05",27]
[null,null,null,null,null,null,"2016-07-06",27]
[null,null,null,null,null,null,"2016-07-07",27]
[null,null,null,null,null,null,"2016-07-08",27]
[null,null,null,null,null,null,"2016-07-09",27]
[null,null,null,null,null,null,"2016-07-10",27]
[null,null,null,null,null,null,"2016-07-11",28]
[null,null,null,null,null,null,"2016-07-12",28]
[null,null,null,null,null,null,"2016-07-13",28]
[null,null,null,null,null,null,"2016-07-14",28]
[null,null,null,null,null,null,"2016-07-15",28]
[null,null,null,null,null,null,"2016-07-16",28]
{"$rows_left_out":3455}