{"text_format":"1","workbook":"xlsx","n_sheets":7,"sheets":["Voorblad","Keuzemenu","Kandidaat","Vacatures","Overzichten","Instellingen","Kandidaat Archief"],"not_rendered":{"charts":2,"images":9,"macros":1,"external_links":0,"defined_names":3,"comments":0,"pivot_tables":0},"unopened":[],"bounds":{"document_bytes":16777216,"sheet_cells":100000,"rows_first":2000,"rows_last":500,"rows_between":2000,"halvings":0,"cell_chars":16384,"cell_head_chars":4096},"cells_cut":0,"cells_raw":0,"read":"whole","date_system":"1900"}

{"sheet":"Voorblad","index":0,"n_rows":34,"n_cols":6,"rows_kept":34,"cut":false,"hidden":false,"merged":[[6,1,6,5]]}
[]
[]
[]
[null,"Werkt de bovenstaande knop niet, dan moet je eerst de onderstaande stappen doorlopen om de macro's te deblokkeren."]
[]
[null,"Dit bestand bevat macro's"]
[null,"In nieuwere versies van Excel is door Microsoft een extra beveiliging geplaatst op het openen van bestanden met macro’s. \nNaast dat macro's erg nuttig kunnen zijn worden ze ook misbruikt voor malware en ransomware. Door de macro's standaard te blokkeren wil Microsoft de strijd aan gaan tegen cybercriminaliteit."]
[null,"Dit Exceldocument bevat macro's om een goede werking van het bestand te garanderen. Deblokkeren van het bestand doet u als volgt:"]
[]
[null,"Stap 1. Blokkade opheffen",null,null,"Stap 2. Macro's inschakelen"]
[null,"a.","U moet het bestand opslaan op een lokale harde schijf (of OneDrive). ",null,"Nadat je de blokkering van het Excelbestand hebt opgeheven, is het (vaak) ook nog nodig om de macro’s in te schakelen."]
[null,"b.","Open Windows Verkenner en zoek het bestand op. "]
[null,"c.","Klik vervolgens met de rechtermuisknop op het bestand en kies Eigenschappen in het contextmenu. \nOnderaan het tabblad Algemeen ziet u een sectie Beveiliging. Schakel het selectievakje Blokkering opheffen in. \n",null,"a.","Dit zie je doordat je een pop-up krijgt met de melding: ‘Microsoft Office heeft een mogelijk beveiligingsprobleem geïdentificeerd.’ of door een gele balk bovenin je Excelbestand met daarin de tekst: ‘BEVEILIGINGSWAARSCHUWING \nMacro’s zijn uitgeschakeld.’ Zie ook afbeeldingen 2 en 3."]
[null,null,"En klik op OK. Zie ook afbeelding 1",null,"b.","In deze gevallen kun je de macro’s inschakelen door op de knop ‘Macro’s inschakelen’ te klikken in het pop-up scherm, of \nop de knop ‘Inhoud inschakelen’ in de gele balk"]
[null,null,"Wanneer u nu het bestand (opnieuw) opent zullen de macro's in het bestand werkzaam zijn."]
[null,null,"Afbeelding 1",null,null,"Afbeelding 2                                                                                                    Afbeelding 3"]
[]
[]
[]
[]
[]
[]
[]
[]
[]
[]
[]
[]
[]
[]
[]
[]
[]
[null,"Deze handleiding is ook terug te lezen via deze link."]

{"sheet":"Keuzemenu","index":1,"n_rows":14,"n_cols":2,"rows_kept":14,"cut":false,"hidden":false,"merged":[]}
[]
[]
[]
[]
[]
[]
[]
[]
[null,"Bestand aanpassen of"]
[null,"een bestand op maat?"]
[null,"Neem contact op via:"]
[]
["*","info@terzake-excel.nl"]
["(","0317 200 009"]

{"sheet":"Kandidaat","index":2,"n_rows":3,"n_cols":16,"rows_kept":3,"cut":false,"hidden":false,"merged":[]}
[]
[]
["Naam","Bron sollicitatie","Type kandidaat","Datum sollicitatie","Vacature","Status","E-mail","Telefoonnummer","Kandidaat score","Datum sollicitatie-gesprek","Interviewer/ Medewerker","tweede Interviewer/ Medewerker","Externe partij","Uren beschikbaar","Salarisindicatie kandidaat","Feedback/Opmerkingen"]

{"sheet":"Vacatures","index":3,"n_rows":3,"n_cols":10,"rows_kept":3,"cut":false,"hidden":false,"merged":[]}
[]
[]
["Vacature","Omschrijving","Datum uitgezet","Ondernomen acties","Belangrijke eisen","Salaris","Aantekeningen","Vacature Status","Contactpersoon","Laatste contact met contactpersoon"]

{"sheet":"Overzichten","index":4,"n_rows":354,"n_cols":9,"rows_kept":354,"cut":false,"hidden":false,"merged":[]}
[]
[]
[null,null,{"$f":"TODAY()","v":"2025-07-02"}]
[null,"Kandidaat","Datum interview","Interviewer/Medewerker","Interviewer/Medewerker 2",null,null,"Aangenomen kandidaten",{"$f":"COUNTIFS(Kandidaat!F:F,\"Afgewezen\")","v":0}]
[null,{"$f":"IF(C5=\"\",\"\",_xlfn.XLOOKUP(C5,Kandidaat!J:J,Kandidaat!A:A))","v":""},{"$f":"_xlfn._xlws.FILTER(_xlfn.IFS(Kandidaat!J4:J1000>=Overzichten!$C$3,Kandidaat!J4:J1000),Kandidaat!J4:J1000<>\"\",\"\")","v":""},{"$f":"IF(C5=\"\",\"\",_xlfn.XLOOKUP(C5,Kandidaat!J:J,Kandidaat!K:K))","v":""},{"$f":"IF(D5=\"\",\"\",_xlfn.XLOOKUP(D5,Kandidaat!K:K,Kandidaat!L:L))","v":""},null,null,"Afgewezen kandidaten",{"$f":"COUNTIFS(Kandidaat!F:F,\"Aangenomen\")","v":0}]
[null,{"$f":"IF(C6=\"\",\"\",_xlfn.XLOOKUP(C6,Kandidaat!J:J,Kandidaat!A:A))","v":""},null,{"$f":"IF(C6=\"\",\"\",_xlfn.XLOOKUP(C6,Kandidaat!J:J,Kandidaat!K:K))","v":""},{"$f":"IF(D6=\"\",\"\",_xlfn.XLOOKUP(D6,Kandidaat!K:K,Kandidaat!L:L))","v":""},null,null,"Open vacatures",{"$f":"COUNTIFS(Vacatures!H:H,\"Open\")","v":0}]
[null,{"$f":"IF(C7=\"\",\"\",_xlfn.XLOOKUP(C7,Kandidaat!J:J,Kandidaat!A:A))","v":""},null,{"$f":"IF(C7=\"\",\"\",_xlfn.XLOOKUP(C7,Kandidaat!J:J,Kandidaat!K:K))","v":""},{"$f":"IF(D7=\"\",\"\",_xlfn.XLOOKUP(D7,Kandidaat!K:K,Kandidaat!L:L))","v":""}]
[null,{"$f":"IF(C8=\"\",\"\",_xlfn.XLOOKUP(C8,Kandidaat!J:J,Kandidaat!A:A))","v":""},null,{"$f":"IF(C8=\"\",\"\",_xlfn.XLOOKUP(C8,Kandidaat!J:J,Kandidaat!K:K))","v":""},{"$f":"IF(D8=\"\",\"\",_xlfn.XLOOKUP(D8,Kandidaat!K:K,Kandidaat!L:L))","v":""}]
[null,{"$f":"IF(C9=\"\",\"\",_xlfn.XLOOKUP(C9,Kandidaat!J:J,Kandidaat!A:A))","v":""},null,{"$f":"IF(C9=\"\",\"\",_xlfn.XLOOKUP(C9,Kandidaat!J:J,Kandidaat!K:K))","v":""},{"$f":"IF(D9=\"\",\"\",_xlfn.XLOOKUP(D9,Kandidaat!K:K,Kandidaat!L:L))","v":""}]
[null,{"$f":"IF(C10=\"\",\"\",_xlfn.XLOOKUP(C10,Kandidaat!J:J,Kandidaat!A:A))","v":""},null,{"$f":"IF(C10=\"\",\"\",_xlfn.XLOOKUP(C10,Kandidaat!J:J,Kandidaat!K:K))","v":""},{"$f":"IF(D10=\"\",\"\",_xlfn.XLOOKUP(D10,Kandidaat!K:K,Kandidaat!L:L))","v":""}]
[null,{"$f":"IF(C11=\"\",\"\",_xlfn.XLOOKUP(C11,Kandidaat!J:J,Kandidaat!A:A))","v":""},null,{"$f":"IF(C11=\"\",\"\",_xlfn.XLOOKUP(C11,Kandidaat!J:J,Kandidaat!K:K))","v":""},{"$f":"IF(D11=\"\",\"\",_xlfn.XLOOKUP(D11,Kandidaat!K:K,Kandidaat!L:L))","v":""}]
[null,{"$f":"IF(C12=\"\",\"\",_xlfn.XLOOKUP(C12,Kandidaat!J:J,Kandidaat!A:A))","v":""},null,{"$f":"IF(C12=\"\",\"\",_xlfn.XLOOKUP(C12,Kandidaat!J:J,Kandidaat!K:K))","v":""},{"$f":"IF(D12=\"\",\"\",_xlfn.XLOOKUP(D12,Kandidaat!K:K,Kandidaat!L:L))","v":""}]
[null,{"$f":"IF(C13=\"\",\"\",_xlfn.XLOOKUP(C13,Kandidaat!J:J,Kandidaat!A:A))","v":""},null,{"$f":"IF(C13=\"\",\"\",_xlfn.XLOOKUP(C13,Kandidaat!J:J,Kandidaat!K:K))","v":""},{"$f":"IF(D13=\"\",\"\",_xlfn.XLOOKUP(D13,Kandidaat!K:K,Kandidaat!L:L))","v":""}]
[null,{"$f":"IF(C14=\"\",\"\",_xlfn.XLOOKUP(C14,Kandidaat!J:J,Kandidaat!A:A))","v":""},null,{"$f":"IF(C14=\"\",\"\",_xlfn.XLOOKUP(C14,Kandidaat!J:J,Kandidaat!K:K))","v":""},{"$f":"IF(D14=\"\",\"\",_xlfn.XLOOKUP(D14,Kandidaat!K:K,Kandidaat!L:L))","v":""}]
[null,{"$f":"IF(C15=\"\",\"\",_xlfn.XLOOKUP(C15,Kandidaat!J:J,Kandidaat!A:A))","v":""},null,{"$f":"IF(C15=\"\",\"\",_xlfn.XLOOKUP(C15,Kandidaat!J:J,Kandidaat!K:K))","v":""},{"$f":"IF(D15=\"\",\"\",_xlfn.XLOOKUP(D15,Kandidaat!K:K,Kandidaat!L:L))","v":""}]
[null,{"$f":"IF(C16=\"\",\"\",_xlfn.XLOOKUP(C16,Kandidaat!J:J,Kandidaat!A:A))","v":""},null,{"$f":"IF(C16=\"\",\"\",_xlfn.XLOOKUP(C16,Kandidaat!J:J,Kandidaat!K:K))","v":""},{"$f":"IF(D16=\"\",\"\",_xlfn.XLOOKUP(D16,Kandidaat!K:K,Kandidaat!L:L))","v":""}]
[null,{"$f":"IF(C17=\"\",\"\",_xlfn.XLOOKUP(C17,Kandidaat!J:J,Kandidaat!A:A))","v":""},null,{"$f":"IF(C17=\"\",\"\",_xlfn.XLOOKUP(C17,Kandidaat!J:J,Kandidaat!K:K))","v":""},{"$f":"IF(D17=\"\",\"\",_xlfn.XLOOKUP(D17,Kandidaat!K:K,Kandidaat!L:L))","v":""}]
[null,{"$f":"IF(C18=\"\",\"\",_xlfn.XLOOKUP(C18,Kandidaat!J:J,Kandidaat!A:A))","v":""},null,{"$f":"IF(C18=\"\",\"\",_xlfn.XLOOKUP(C18,Kandidaat!J:J,Kandidaat!K:K))","v":""},{"$f":"IF(D18=\"\",\"\",_xlfn.XLOOKUP(D18,Kandidaat!K:K,Kandidaat!L:L))","v":""}]
[null,{"$f":"IF(C19=\"\",\"\",_xlfn.XLOOKUP(C19,Kandidaat!J:J,Kandidaat!A:A))","v":""},null,{"$f":"IF(C19=\"\",\"\",_xlfn.XLOOKUP(C19,Kandidaat!J:J,Kandidaat!K:K))","v":""},{"$f":"IF(D19=\"\",\"\",_xlfn.XLOOKUP(D19,Kandidaat!K:K,Kandidaat!L:L))","v":""}]
[null,{"$f":"IF(C20=\"\",\"\",_xlfn.XLOOKUP(C20,Kandidaat!J:J,Kandidaat!A:A))","v":""},null,{"$f":"IF(C20=\"\",\"\",_xlfn.XLOOKUP(C20,Kandidaat!J:J,Kandidaat!K:K))","v":""},{"$f":"IF(D20=\"\",\"\",_xlfn.XLOOKUP(D20,Kandidaat!K:K,Kandidaat!L:L))","v":""}]
[null,{"$f":"IF(C21=\"\",\"\",_xlfn.XLOOKUP(C21,Kandidaat!J:J,Kandidaat!A:A))","v":""},null,{"$f":"IF(C21=\"\",\"\",_xlfn.XLOOKUP(C21,Kandidaat!J:J,Kandidaat!K:K))","v":""},{"$f":"IF(D21=\"\",\"\",_xlfn.XLOOKUP(D21,Kandidaat!K:K,Kandidaat!L:L))","v":""}]
[null,{"$f":"IF(C22=\"\",\"\",_xlfn.XLOOKUP(C22,Kandidaat!J:J,Kandidaat!A:A))","v":""},null,{"$f":"IF(C22=\"\",\"\",_xlfn.XLOOKUP(C22,Kandidaat!J:J,Kandidaat!K:K))","v":""},{"$f":"IF(D22=\"\",\"\",_xlfn.XLOOKUP(D22,Kandidaat!K:K,Kandidaat!L:L))","v":""}]
[null,{"$f":"IF(C23=\"\",\"\",_xlfn.XLOOKUP(C23,Kandidaat!J:J,Kandidaat!A:A))","v":""},null,{"$f":"IF(C23=\"\",\"\",_xlfn.XLOOKUP(C23,Kandidaat!J:J,Kandidaat!K:K))","v":""},{"$f":"IF(D23=\"\",\"\",_xlfn.XLOOKUP(D23,Kandidaat!K:K,Kandidaat!L:L))","v":""}]
[null,{"$f":"IF(C24=\"\",\"\",_xlfn.XLOOKUP(C24,Kandidaat!J:J,Kandidaat!A:A))","v":""},null,{"$f":"IF(C24=\"\",\"\",_xlfn.XLOOKUP(C24,Kandidaat!J:J,Kandidaat!K:K))","v":""},{"$f":"IF(D24=\"\",\"\",_xlfn.XLOOKUP(D24,Kandidaat!K:K,Kandidaat!L:L))","v":""}]
[null,{"$f":"IF(C25=\"\",\"\",_xlfn.XLOOKUP(C25,Kandidaat!J:J,Kandidaat!A:A))","v":""},null,{"$f":"IF(C25=\"\",\"\",_xlfn.XLOOKUP(C25,Kandidaat!J:J,Kandidaat!K:K))","v":""},{"$f":"IF(D25=\"\",\"\",_xlfn.XLOOKUP(D25,Kandidaat!K:K,Kandidaat!L:L))","v":""}]
[null,{"$f":"IF(C26=\"\",\"\",_xlfn.XLOOKUP(C26,Kandidaat!J:J,Kandidaat!A:A))","v":""},null,{"$f":"IF(C26=\"\",\"\",_xlfn.XLOOKUP(C26,Kandidaat!J:J,Kandidaat!K:K))","v":""},{"$f":"IF(D26=\"\",\"\",_xlfn.XLOOKUP(D26,Kandidaat!K:K,Kandidaat!L:L))","v":""}]
[null,{"$f":"IF(C27=\"\",\"\",_xlfn.XLOOKUP(C27,Kandidaat!J:J,Kandidaat!A:A))","v":""},null,{"$f":"IF(C27=\"\",\"\",_xlfn.XLOOKUP(C27,Kandidaat!J:J,Kandidaat!K:K))","v":""},{"$f":"IF(D27=\"\",\"\",_xlfn.XLOOKUP(D27,Kandidaat!K:K,Kandidaat!L:L))","v":""}]
[null,{"$f":"IF(C28=\"\",\"\",_xlfn.XLOOKUP(C28,Kandidaat!J:J,Kandidaat!A:A))","v":""},null,{"$f":"IF(C28=\"\",\"\",_xlfn.XLOOKUP(C28,Kandidaat!J:J,Kandidaat!K:K))","v":""},{"$f":"IF(D28=\"\",\"\",_xlfn.XLOOKUP(D28,Kandidaat!K:K,Kandidaat!L:L))","v":""}]
[null,{"$f":"IF(C29=\"\",\"\",_xlfn.XLOOKUP(C29,Kandidaat!J:J,Kandidaat!A:A))","v":""},null,{"$f":"IF(C29=\"\",\"\",_xlfn.XLOOKUP(C29,Kandidaat!J:J,Kandidaat!K:K))","v":""},{"$f":"IF(D29=\"\",\"\",_xlfn.XLOOKUP(D29,Kandidaat!K:K,Kandidaat!L:L))","v":""}]
[null,{"$f":"IF(C30=\"\",\"\",_xlfn.XLOOKUP(C30,Kandidaat!J:J,Kandidaat!A:A))","v":""},null,{"$f":"IF(C30=\"\",\"\",_xlfn.XLOOKUP(C30,Kandidaat!J:J,Kandidaat!K:K))","v":""},{"$f":"IF(D30=\"\",\"\",_xlfn.XLOOKUP(D30,Kandidaat!K:K,Kandidaat!L:L))","v":""}]
[null,{"$f":"IF(C31=\"\",\"\",_xlfn.XLOOKUP(C31,Kandidaat!J:J,Kandidaat!A:A))","v":""},null,{"$f":"IF(C31=\"\",\"\",_xlfn.XLOOKUP(C31,Kandidaat!J:J,Kandidaat!K:K))","v":""},{"$f":"IF(D31=\"\",\"\",_xlfn.XLOOKUP(D31,Kandidaat!K:K,Kandidaat!L:L))","v":""}]
[null,{"$f":"IF(C32=\"\",\"\",_xlfn.XLOOKUP(C32,Kandidaat!J:J,Kandidaat!A:A))","v":""},null,{"$f":"IF(C32=\"\",\"\",_xlfn.XLOOKUP(C32,Kandidaat!J:J,Kandidaat!K:K))","v":""},{"$f":"IF(D32=\"\",\"\",_xlfn.XLOOKUP(D32,Kandidaat!K:K,Kandidaat!L:L))","v":""}]
[null,{"$f":"IF(C33=\"\",\"\",_xlfn.XLOOKUP(C33,Kandidaat!J:J,Kandidaat!A:A))","v":""},null,{"$f":"IF(C33=\"\",\"\",_xlfn.XLOOKUP(C33,Kandidaat!J:J,Kandidaat!K:K))","v":""},{"$f":"IF(D33=\"\",\"\",_xlfn.XLOOKUP(D33,Kandidaat!K:K,Kandidaat!L:L))","v":""}]
[null,{"$f":"IF(C34=\"\",\"\",_xlfn.XLOOKUP(C34,Kandidaat!J:J,Kandidaat!A:A))","v":""},null,{"$f":"IF(C34=\"\",\"\",_xlfn.XLOOKUP(C34,Kandidaat!J:J,Kandidaat!K:K))","v":""},{"$f":"IF(D34=\"\",\"\",_xlfn.XLOOKUP(D34,Kandidaat!K:K,Kandidaat!L:L))","v":""}]
[null,{"$f":"IF(C35=\"\",\"\",_xlfn.XLOOKUP(C35,Kandidaat!J:J,Kandidaat!A:A))","v":""},null,{"$f":"IF(C35=\"\",\"\",_xlfn.XLOOKUP(C35,Kandidaat!J:J,Kandidaat!K:K))","v":""},{"$f":"IF(D35=\"\",\"\",_xlfn.XLOOKUP(D35,Kandidaat!K:K,Kandidaat!L:L))","v":""}]
[null,{"$f":"IF(C36=\"\",\"\",_xlfn.XLOOKUP(C36,Kandidaat!J:J,Kandidaat!A:A))","v":""},null,{"$f":"IF(C36=\"\",\"\",_xlfn.XLOOKUP(C36,Kandidaat!J:J,Kandidaat!K:K))","v":""},{"$f":"IF(D36=\"\",\"\",_xlfn.XLOOKUP(D36,Kandidaat!K:K,Kandidaat!L:L))","v":""}]
[null,{"$f":"IF(C37=\"\",\"\",_xlfn.XLOOKUP(C37,Kandidaat!J:J,Kandidaat!A:A))","v":""},null,{"$f":"IF(C37=\"\",\"\",_xlfn.XLOOKUP(C37,Kandidaat!J:J,Kandidaat!K:K))","v":""},{"$f":"IF(D37=\"\",\"\",_xlfn.XLOOKUP(D37,Kandidaat!K:K,Kandidaat!L:L))","v":""}]
[null,{"$f":"IF(C38=\"\",\"\",_xlfn.XLOOKUP(C38,Kandidaat!J:J,Kandidaat!A:A))","v":""},null,{"$f":"IF(C38=\"\",\"\",_xlfn.XLOOKUP(C38,Kandidaat!J:J,Kandidaat!K:K))","v":""},{"$f":"IF(D38=\"\",\"\",_xlfn.XLOOKUP(D38,Kandidaat!K:K,Kandidaat!L:L))","v":""}]
[null,{"$f":"IF(C39=\"\",\"\",_xlfn.XLOOKUP(C39,Kandidaat!J:J,Kandidaat!A:A))","v":""},null,{"$f":"IF(C39=\"\",\"\",_xlfn.XLOOKUP(C39,Kandidaat!J:J,Kandidaat!K:K))","v":""},{"$f":"IF(D39=\"\",\"\",_xlfn.XLOOKUP(D39,Kandidaat!K:K,Kandidaat!L:L))","v":""}]
[null,{"$f":"IF(C40=\"\",\"\",_xlfn.XLOOKUP(C40,Kandidaat!J:J,Kandidaat!A:A))","v":""},null,{"$f":"IF(C40=\"\",\"\",_xlfn.XLOOKUP(C40,Kandidaat!J:J,Kandidaat!K:K))","v":""},{"$f":"IF(D40=\"\",\"\",_xlfn.XLOOKUP(D40,Kandidaat!K:K,Kandidaat!L:L))","v":""}]
[null,{"$f":"IF(C41=\"\",\"\",_xlfn.XLOOKUP(C41,Kandidaat!J:J,Kandidaat!A:A))","v":""},null,{"$f":"IF(C41=\"\",\"\",_xlfn.XLOOKUP(C41,Kandidaat!J:J,Kandidaat!K:K))","v":""},{"$f":"IF(D41=\"\",\"\",_xlfn.XLOOKUP(D41,Kandidaat!K:K,Kandidaat!L:L))","v":""}]
[null,{"$f":"IF(C42=\"\",\"\",_xlfn.XLOOKUP(C42,Kandidaat!J:J,Kandidaat!A:A))","v":""},null,{"$f":"IF(C42=\"\",\"\",_xlfn.XLOOKUP(C42,Kandidaat!J:J,Kandidaat!K:K))","v":""},{"$f":"IF(D42=\"\",\"\",_xlfn.XLOOKUP(D42,Kandidaat!K:K,Kandidaat!L:L))","v":""}]
[null,{"$f":"IF(C43=\"\",\"\",_xlfn.XLOOKUP(C43,Kandidaat!J:J,Kandidaat!A:A))","v":""},null,{"$f":"IF(C43=\"\",\"\",_xlfn.XLOOKUP(C43,Kandidaat!J:J,Kandidaat!K:K))","v":""},{"$f":"IF(D43=\"\",\"\",_xlfn.XLOOKUP(D43,Kandidaat!K:K,Kandidaat!L:L))","v":""}]
[null,{"$f":"IF(C44=\"\",\"\",_xlfn.XLOOKUP(C44,Kandidaat!J:J,Kandidaat!A:A))","v":""},null,{"$f":"IF(C44=\"\",\"\",_xlfn.XLOOKUP(C44,Kandidaat!J:J,Kandidaat!K:K))","v":""},{"$f":"IF(D44=\"\",\"\",_xlfn.XLOOKUP(D44,Kandidaat!K:K,Kandidaat!L:L))","v":""}]
[null,{"$f":"IF(C45=\"\",\"\",_xlfn.XLOOKUP(C45,Kandidaat!J:J,Kandidaat!A:A))","v":""},null,{"$f":"IF(C45=\"\",\"\",_xlfn.XLOOKUP(C45,Kandidaat!J:J,Kandidaat!K:K))","v":""},{"$f":"IF(D45=\"\",\"\",_xlfn.XLOOKUP(D45,Kandidaat!K:K,Kandidaat!L:L))","v":""}]
[null,{"$f":"IF(C46=\"\",\"\",_xlfn.XLOOKUP(C46,Kandidaat!J:J,Kandidaat!A:A))","v":""},null,{"$f":"IF(C46=\"\",\"\",_xlfn.XLOOKUP(C46,Kandidaat!J:J,Kandidaat!K:K))","v":""},{"$f":"IF(D46=\"\",\"\",_xlfn.XLOOKUP(D46,Kandidaat!K:K,Kandidaat!L:L))","v":""}]
[null,{"$f":"IF(C47=\"\",\"\",_xlfn.XLOOKUP(C47,Kandidaat!J:J,Kandidaat!A:A))","v":""},null,{"$f":"IF(C47=\"\",\"\",_xlfn.XLOOKUP(C47,Kandidaat!J:J,Kandidaat!K:K))","v":""},{"$f":"IF(D47=\"\",\"\",_xlfn.XLOOKUP(D47,Kandidaat!K:K,Kandidaat!L:L))","v":""}]
[null,{"$f":"IF(C48=\"\",\"\",_xlfn.XLOOKUP(C48,Kandidaat!J:J,Kandidaat!A:A))","v":""},null,{"$f":"IF(C48=\"\",\"\",_xlfn.XLOOKUP(C48,Kandidaat!J:J,Kandidaat!K:K))","v":""},{"$f":"IF(D48=\"\",\"\",_xlfn.XLOOKUP(D48,Kandidaat!K:K,Kandidaat!L:L))","v":""}]
[null,{"$f":"IF(C49=\"\",\"\",_xlfn.XLOOKUP(C49,Kandidaat!J:J,Kandidaat!A:A))","v":""},null,{"$f":"IF(C49=\"\",\"\",_xlfn.XLOOKUP(C49,Kandidaat!J:J,Kandidaat!K:K))","v":""},{"$f":"IF(D49=\"\",\"\",_xlfn.XLOOKUP(D49,Kandidaat!K:K,Kandidaat!L:L))","v":""}]
[null,{"$f":"IF(C50=\"\",\"\",_xlfn.XLOOKUP(C50,Kandidaat!J:J,Kandidaat!A:A))","v":""},null,{"$f":"IF(C50=\"\",\"\",_xlfn.XLOOKUP(C50,Kandidaat!J:J,Kandidaat!K:K))","v":""},{"$f":"IF(D50=\"\",\"\",_xlfn.XLOOKUP(D50,Kandidaat!K:K,Kandidaat!L:L))","v":""}]
[null,{"$f":"IF(C51=\"\",\"\",_xlfn.XLOOKUP(C51,Kandidaat!J:J,Kandidaat!A:A))","v":""},null,{"$f":"IF(C51=\"\",\"\",_xlfn.XLOOKUP(C51,Kandidaat!J:J,Kandidaat!K:K))","v":""},{"$f":"IF(D51=\"\",\"\",_xlfn.XLOOKUP(D51,Kandidaat!K:K,Kandidaat!L:L))","v":""}]
[null,{"$f":"IF(C52=\"\",\"\",_xlfn.XLOOKUP(C52,Kandidaat!J:J,Kandidaat!A:A))","v":""},null,{"$f":"IF(C52=\"\",\"\",_xlfn.XLOOKUP(C52,Kandidaat!J:J,Kandidaat!K:K))","v":""},{"$f":"IF(D52=\"\",\"\",_xlfn.XLOOKUP(D52,Kandidaat!K:K,Kandidaat!L:L))","v":""}]
[null,{"$f":"IF(C53=\"\",\"\",_xlfn.XLOOKUP(C53,Kandidaat!J:J,Kandidaat!A:A))","v":""},null,{"$f":"IF(C53=\"\",\"\",_xlfn.XLOOKUP(C53,Kandidaat!J:J,Kandidaat!K:K))","v":""},{"$f":"IF(D53=\"\",\"\",_xlfn.XLOOKUP(D53,Kandidaat!K:K,Kandidaat!L:L))","v":""}]
[null,{"$f":"IF(C54=\"\",\"\",_xlfn.XLOOKUP(C54,Kandidaat!J:J,Kandidaat!A:A))","v":""},null,{"$f":"IF(C54=\"\",\"\",_xlfn.XLOOKUP(C54,Kandidaat!J:J,Kandidaat!K:K))","v":""},{"$f":"IF(D54=\"\",\"\",_xlfn.XLOOKUP(D54,Kandidaat!K:K,Kandidaat!L:L))","v":""}]
[null,{"$f":"IF(C55=\"\",\"\",_xlfn.XLOOKUP(C55,Kandidaat!J:J,Kandidaat!A:A))","v":""},null,{"$f":"IF(C55=\"\",\"\",_xlfn.XLOOKUP(C55,Kandidaat!J:J,Kandidaat!K:K))","v":""},{"$f":"IF(D55=\"\",\"\",_xlfn.XLOOKUP(D55,Kandidaat!K:K,Kandidaat!L:L))","v":""}]
[null,{"$f":"IF(C56=\"\",\"\",_xlfn.XLOOKUP(C56,Kandidaat!J:J,Kandidaat!A:A))","v":""},null,{"$f":"IF(C56=\"\",\"\",_xlfn.XLOOKUP(C56,Kandidaat!J:J,Kandidaat!K:K))","v":""},{"$f":"IF(D56=\"\",\"\",_xlfn.XLOOKUP(D56,Kandidaat!K:K,Kandidaat!L:L))","v":""}]
[null,{"$f":"IF(C57=\"\",\"\",_xlfn.XLOOKUP(C57,Kandidaat!J:J,Kandidaat!A:A))","v":""},null,{"$f":"IF(C57=\"\",\"\",_xlfn.XLOOKUP(C57,Kandidaat!J:J,Kandidaat!K:K))","v":""},{"$f":"IF(D57=\"\",\"\",_xlfn.XLOOKUP(D57,Kandidaat!K:K,Kandidaat!L:L))","v":""}]
[null,{"$f":"IF(C58=\"\",\"\",_xlfn.XLOOKUP(C58,Kandidaat!J:J,Kandidaat!A:A))","v":""},null,{"$f":"IF(C58=\"\",\"\",_xlfn.XLOOKUP(C58,Kandidaat!J:J,Kandidaat!K:K))","v":""},{"$f":"IF(D58=\"\",\"\",_xlfn.XLOOKUP(D58,Kandidaat!K:K,Kandidaat!L:L))","v":""}]
[null,{"$f":"IF(C59=\"\",\"\",_xlfn.XLOOKUP(C59,Kandidaat!J:J,Kandidaat!A:A))","v":""},null,{"$f":"IF(C59=\"\",\"\",_xlfn.XLOOKUP(C59,Kandidaat!J:J,Kandidaat!K:K))","v":""},{"$f":"IF(D59=\"\",\"\",_xlfn.XLOOKUP(D59,Kandidaat!K:K,Kandidaat!L:L))","v":""}]
[null,{"$f":"IF(C60=\"\",\"\",_xlfn.XLOOKUP(C60,Kandidaat!J:J,Kandidaat!A:A))","v":""},null,{"$f":"IF(C60=\"\",\"\",_xlfn.XLOOKUP(C60,Kandidaat!J:J,Kandidaat!K:K))","v":""},{"$f":"IF(D60=\"\",\"\",_xlfn.XLOOKUP(D60,Kandidaat!K:K,Kandidaat!L:L))","v":""}]
{"$rows_left_out":295}
{"sheet":"Instellingen","index":5,"n_rows":29,"n_cols":26,"rows_kept":29,"cut":false,"hidden":false,"merged":[]}
[3]
[null,null,"Bron sollicitatie","Aantal",null,"Type kandidaat",null,null,"Statussen kandidaten","Aantal",null,null,"Interviewer / Medewerker / Contactpersoon",null,null,"Externe partij",null,null,null,"Kandidaat score",null,null,"Vacature status",null,null,"Ondernomen acties vacature"]
[null,null,"Website",{"$f":"COUNTIFS(Kandidaat!$B$4:$B$995,C3)","v":0},null,"Vacature",null,null,"Gescreened",{"$f":"COUNTIFS(Kandidaat!$F$4:$F$995,I3)","v":0},null,null,"A",null,null,"Nee",null,null,null,"1- Niet acceptabel",null,null,"Open",null,null,"Indeed"]
[null,null,"Indeed",{"$f":"COUNTIFS(Kandidaat!$B$4:$B$995,C4)","v":0},null,"Open sollicitatie",null,null,"Doorgestuurd medebeoordelaar",{"$f":"COUNTIFS(Kandidaat!$F$4:$F$995,I4)","v":0},null,null,"B",null,null,"Alpha Recruiters",null,null,null,"2- Acceptabel",null,null,"Vervuld",null,null,"LinkedIn"]
[null,null,"LinkedIn",{"$f":"COUNTIFS(Kandidaat!$B$4:$B$995,C5)","v":0},null,null,null,null,"Uitgenodigd interview",{"$f":"COUNTIFS(Kandidaat!$F$4:$F$995,I5)","v":0},null,null,"C",null,null,"Beta Recruiters",null,null,null,"3- Goede kandidaat",null,null,"Geannuleerd",null,null,"Facebook"]
[null,null,"Telefonisch",{"$f":"COUNTIFS(Kandidaat!$B$4:$B$995,C6)","v":0},null,null,null,null,"Referentie check",{"$f":"COUNTIFS(Kandidaat!$F$4:$F$995,I6)","v":0},null,null,null,null,null,null,null,null,null,"4- Uitstekende kandidaat",null,null,null,null,null,"Website"]
[null,null,"Banensite.nl",{"$f":"COUNTIFS(Kandidaat!$B$4:$B$995,C7)","v":0},null,null,null,null,"Eerste gesprek",{"$f":"COUNTIFS(Kandidaat!$F$4:$F$995,I7)","v":0},null,null,null,null,null,null,null,null,null,null,null,null,null,null,null,"Recruiter"]
[null,null,"Banensite2.nl",{"$f":"COUNTIFS(Kandidaat!$B$4:$B$995,C8)","v":0},null,null,null,null,"Tweede gesprek",{"$f":"COUNTIFS(Kandidaat!$F$4:$F$995,I8)","v":0},null,null,null,null,null,null,null,null,null,null,null,null,null,null,null,"banensite.nl"]
[null,null,"Banensite3.nl",{"$f":"COUNTIFS(Kandidaat!$B$4:$B$995,C9)","v":0},null,null,null,null,"Arbeidsvoorwaarden gesprek",{"$f":"COUNTIFS(Kandidaat!$F$4:$F$995,I9)","v":0}]
[null,null,null,{"$f":"COUNTIFS(Kandidaat!$B$4:$B$995,C10)","v":0},null,null,null,null,"Aangenomen",{"$f":"COUNTIFS(Kandidaat!$F$4:$F$995,I10)","v":0}]
[null,null,null,{"$f":"COUNTIFS(Kandidaat!$B$4:$B$995,C11)","v":0},null,null,null,null,"Afgewezen",{"$f":"COUNTIFS(Kandidaat!$F$4:$F$995,I11)","v":0}]
[null,null,null,{"$f":"COUNTIFS(Kandidaat!$B$4:$B$995,C12)","v":0},null,null,null,null,null,{"$f":"COUNTIFS(Kandidaat!$F$4:$F$995,I12)","v":0}]
[null,null,null,{"$f":"COUNTIFS(Kandidaat!$B$4:$B$995,C13)","v":0},null,null,null,null,null,{"$f":"COUNTIFS(Kandidaat!$F$4:$F$995,I13)","v":0}]
[null,null,null,{"$f":"COUNTIFS(Kandidaat!$B$4:$B$995,C14)","v":0},null,null,null,null,null,{"$f":"COUNTIFS(Kandidaat!$F$4:$F$995,I14)","v":0}]
[null,null,null,{"$f":"COUNTIFS(Kandidaat!$B$4:$B$995,C15)","v":0},null,null,null,null,null,{"$f":"COUNTIFS(Kandidaat!$F$4:$F$995,I15)","v":0}]
[null,null,null,{"$f":"COUNTIFS(Kandidaat!$B$4:$B$995,C16)","v":0},null,null,null,null,null,{"$f":"COUNTIFS(Kandidaat!$F$4:$F$995,I16)","v":0}]
[null,null,null,{"$f":"COUNTIFS(Kandidaat!$B$4:$B$995,C17)","v":0},null,null,null,null,null,{"$f":"COUNTIFS(Kandidaat!$F$4:$F$995,I17)","v":0}]
[null,null,null,{"$f":"COUNTIFS(Kandidaat!$B$4:$B$995,C18)","v":0},null,null,null,null,null,{"$f":"COUNTIFS(Kandidaat!$F$4:$F$995,I18)","v":0}]
[null,null,null,{"$f":"COUNTIFS(Kandidaat!$B$4:$B$995,C19)","v":0},null,null,null,null,null,{"$f":"COUNTIFS(Kandidaat!$F$4:$F$995,I19)","v":0}]
[null,null,null,{"$f":"COUNTIFS(Kandidaat!$B$4:$B$995,C20)","v":0},null,null,null,null,null,{"$f":"COUNTIFS(Kandidaat!$F$4:$F$995,I20)","v":0}]
[null,null,null,{"$f":"COUNTIFS(Kandidaat!$B$4:$B$995,C21)","v":0},null,null,null,null,null,{"$f":"COUNTIFS(Kandidaat!$F$4:$F$995,I21)","v":0}]
[null,null,null,{"$f":"COUNTIFS(Kandidaat!$B$4:$B$995,C22)","v":0},null,null,null,null,null,{"$f":"COUNTIFS(Kandidaat!$F$4:$F$995,I22)","v":0}]
[null,null,null,{"$f":"COUNTIFS(Kandidaat!$B$4:$B$995,C23)","v":0},null,null,null,null,null,{"$f":"COUNTIFS(Kandidaat!$F$4:$F$995,I23)","v":0}]
[null,null,null,{"$f":"COUNTIFS(Kandidaat!$B$4:$B$995,C24)","v":0},null,null,null,null,null,{"$f":"COUNTIFS(Kandidaat!$F$4:$F$995,I24)","v":0}]
[null,null,null,{"$f":"COUNTIFS(Kandidaat!$B$4:$B$995,C25)","v":0},null,null,null,null,null,{"$f":"COUNTIFS(Kandidaat!$F$4:$F$995,I25)","v":0}]
[null,null,null,{"$f":"COUNTIFS(Kandidaat!$B$4:$B$995,C26)","v":0},null,null,null,null,null,{"$f":"COUNTIFS(Kandidaat!$F$4:$F$995,I26)","v":0}]
[null,null,null,{"$f":"COUNTIFS(Kandidaat!$B$4:$B$995,C27)","v":0},null,null,null,null,null,{"$f":"COUNTIFS(Kandidaat!$F$4:$F$995,I27)","v":0}]
[null,null,null,{"$f":"COUNTIFS(Kandidaat!$B$4:$B$995,C28)","v":0},null,null,null,null,null,{"$f":"COUNTIFS(Kandidaat!$F$4:$F$995,I28)","v":0}]
[null,null,null,{"$f":"COUNTIFS(Kandidaat!$B$4:$B$995,C29)","v":0},null,null,null,null,null,{"$f":"COUNTIFS(Kandidaat!$F$4:$F$995,I29)","v":0}]

{"sheet":"Kandidaat Archief","index":6,"n_rows":3,"n_cols":16,"rows_kept":3,"cut":false,"hidden":false,"merged":[]}
[]
[]
["Naam","Bron sollicitatie","Type kandidaat","Datum sollicitatie","Vacature","Status","E-mail","Telefoonnummer","Kandidaat score","Datum sollicitatie-gesprek","Interviewer/ Medewerker","tweede Interviewer/ Medewerker","Externe partij","Uren beschikbaar","Salarisindicatie kandidaat","Feedback/Opmerkingen"]